{"text_format":"1","workbook":"xlsx","n_sheets":8,"sheets":["Startsida","1. Svar till systemfrågorna","2. Svar till Klimatfrågorna","3. Sammanfattande analys","4. Oönskade händelser","5. Riskanalys","6. Åtgärdsanalys","Beräkningsunderlag riskmatris"],"not_rendered":{"charts":0,"images":3,"macros":1,"external_links":0,"defined_names":9,"comments":3,"pivot_tables":0},"unopened":[],"bounds":{"document_bytes":16777216,"sheet_cells":100000,"rows_first":2000,"rows_last":500,"rows_between":2000,"halvings":0,"cell_chars":16384,"cell_head_chars":4096},"cells_cut":0,"cells_raw":0,"read":"whole","date_system":"1900"}

{"sheet":"Startsida","index":0,"n_rows":27,"n_cols":3,"rows_kept":27,"cut":false,"hidden":false,"merged":[[22,1,22,2],[23,1,23,2],[24,1,24,2],[25,1,25,2],[14,1,14,2],[15,1,15,2],[20,1,20,2],[21,1,21,2],[19,1,19,5],[1,1,1,6],[3,1,3,5],[11,1,11,2],[12,1,12,2],[13,1,13,2]]}
[]
[null,"Välkommen till hjälpmedlet till Handbok för klimatanpassad dricksvattenförsörjning"]
[]
[null,"Frågorna man besvarar ska resultera i ett antal identifierade oönskade händelser som man sedan jobbar vidare med under risk- och åtgärdsanalysen i mallen "]
[]
[null,"Fyll i vattentäktens namn","Grusstad"]
[null,"Fyll i Startdatum för analysen","2019-01-29"]
[null,"Fyll i namn på deltagare och organisationstillhörighet\n(Tips - bryt rad inom cellen med Alt+Enter)"]
[]
[]
[null,"Lite tips innan ni börjar:"]
[null," - Godkänn \"Aktivera innehåll\" om en gul markering kommer upp vid uppstart av dokumentet."]
[null," - Viktigt att börja från en TOM mall när man gör analysen."]
[null," - Läs  varje kapitel i handboken innan ni fyller i mallen"]
[null," - Ha någon som följer med i handboken samtidigt som mallen fylls i"]
[null," - Försök att dokumentera så bra som möjligt. Hänvisa gärna till utredningar men försök få en kort sammanfattning här."]
[]
[]
[null,"Vill du ta bort data?"]
[null,"Eftersom mallen är synkad gäller det att tänka till när saker skall raderas:  Börja alltid bort texten och poängen från den flik som har högst nummer. "]
[null,"Från flik 5 tar du endast bort, åtgärdas, målfunktion, åtgärder och kommentarer"]
[null,"Från flik 4 tar ni bort sannolik och konsekvenssifforna och om ni manuellt har valt frågor till åtgärdsanalysen"]
[null,"Från flik 3 tar ni bort påverkan av klimatfaktorer, klimatfaktorerna och förekommer förutspås."]
[null,"Från flik 2 tar ni bort oönskade händelser, kommentarer/utredningsbehov och svar/sammanfattning"]
[null,"Från flik 1 tar ni bort oönskade händelser, kommentarer/utredningsbehov och svar/sammanfattning"]
[null,"Ta nu och uppdatera flikarna 3, 4 och 5 så ska det vara tomt på information."]
[null," Tänk på att det finns interna länkar i dokumentet försök behålla skyddet"]

{"sheet":"1. Svar till systemfrågorna","index":1,"n_rows":84,"n_cols":5,"rows_kept":84,"cut":false,"hidden":false,"merged":[[55,2,55,4],[68,2,68,4],[76,2,76,4],[83,2,83,4],[19,2,19,4],[32,2,32,4],[44,2,44,4]]}
[null,"Systemanalys - svarsammanställning",{"$f":"Startsida!C6","v":"Grusstad"}]
[]
[]
[]
[]
[]
[]
[null,"SYSTEMANALYS"]
[null,"Frågor","Svar/sammanfattning","Kommentarer/utredningsbehov","Oönskade händelser"]
["A"," Vattenkapacitet och vattenbehov"]
["A1","Hur stor är vattenresursens samt vattentäktens kapacitet i dagsläget i förhållande till vattenbehovet?","Uttagsmöjlighet i brunnarna är ca 3200 m3/dygn, vilket dock maximalt kan tas ut över en \n2-veckors period (45 000 m3), därefter är grundvattenavsänkningen i magasinet för stort. Råvattenpumpkapaciteten är 5500 m3/dygn.\n\nNormal förbrukning ca 300 m3/dygn. Förbrukningen under högsäsong (sommaren) betydligt större, ca 3100 m3/dygn. Se separat utredning ”Grusstads vattenförbrukning- nuläge och prognos 2040” . \n",null,"Vattenbrist under perioder med stora vattenutttag, vilket ofta sammanfaller med perioder med låga grundvattennivåer (sommaren)."]
["A2"," Finns andra (enskilda, verksamheter, kommuner etc.) som nyttjar vattenresursen? ","Jordbruket har uttagsrätter i isälvsavlagringen. Kan innebära ökad konkurrens i framtiden.","Vattenbehovet/tillgänglig vattenmängd bör utredas","Eftersom tillstånd inte finns föreligger risk att andra verksamheter, exempelvis jordbruk, ökar uttag och därmed ger sänkta vattennivåer som kan leda till vattenbrist."]
["A3"," Finns det några framtidsplaner eller förändringar som kan påverka vattenbehovet (utifrån folkmängd och utbredning, markanvändning, affärsverksamhet eller andra privata aktörer)?","Antalet invånare 1 500 (2018) minskande med 25 personer per år. Besöksnäring ca 15 000 personer sommartid. Politisk vilja att bibehålla antalet åretruntboende samt att öka besöksnäringen på sommar och vinter till 17 000 personer.","Vattenbehovet bör utredas"]
["A4"," Vad begränsar vattentäktens kapacitet?","Brunnsutformningen och grundvattenmagasinets kapacitet"]
["A5"," Finns tillstånd för att leda bort vatten eller har andra vattenverksamheter tillstånd att ta ut vatten som leder till minskad vattenkapacitet?","Tillstånd saknas","Kommunen bör söka tillstånd för vattenuttaget"]
["A6"," Finns det tillgång till reservvatten?","Nej","Bör utredas"]
["A7"," Finns det tillgång till nödvatten? ","Ja, tankbil från centralorten"]
["A8"," Hur kommer vattenbehovet att förändras inom 5, 20 och 70 år?","Vattenbehovet kommer att minska under normalsäsong men öka under högsäsong (sommaren)"]
["A9","Egen text"]
["A10","Skriv en Sammanfattande analys av avsnittet ovan:\n(Tips: Bryt rad genom Alt + Enter)","Normal förbrukning klarar vattentäktens kapacitet. Under högsäsong kan det i framtiden bli problem med kapaciteten då det redan i dagsläget är liten marginal och besöksnäringen ökar. Risk för vattenbrist under högsäsong."]
["B","Markförhållanden"]
["B1"," Är vattentäkten en yt- eller grundvattentäkt? Sker inducerad eller konstgjord infiltration? ","Grundvattentäkt (isälvsavlagring). Inducerad infiltration till isälvsavlagringen sker. "]
["B2","Hur lång är uppehållstiden från olika delar av tillrinningsområdet?","Ej känt, bör utredas. ","Bör utredas"]
["B3"," Hur rör sig vattnet mot vattentäkten? Förändras flödesriktningarna vid olika stora vattenuttag?","Flödesriktning från norr till söder i åsen. Vid stora vattenuttag kan flödesriktningen ändras så att andra föroreningskällor kan påverka vattentäkten.","Bör utredas"]
["B4","Finns risk för ras och skred i tillrinningsområdet eller i anslutning till anläggningar på grund av geologiska förutsättningar?","Risken för ras är liten pga att isälvsmaterialet inte är skredbenäget enligt skredkartering."]
["B5"," Finns det täckande finkorniga lager eller andra barriärer vid vattentäkten? ","Det finns finkorniga jordlager på delar av isälvsavlagringen"]
["B6"," Hur ligger vattentäkten och anläggningsdelar topografiskt? Finns risk för översvämningar?","Vattentäkten och dess anläggningsdelar är topografiskt högt belägna och risken för översvämning bedöms som liten. Inga problem har observerats enligt tillgängliga uppgifter från driftpersonal."]
["B7"," Hur ser vegetationen ut? Finns skyddande vegetation på grundvattenresursen? Finns skyddsremsor eller skyddszoner med vegetation vid ytvattenresursen?","Det finns skyddande vegetation på delar av isälvsavlagringen, dock inte på hela."]
["B8"," Ligger vattentäkt och anläggningsdelar havsnära?","Nej"]
["B9"," Hur ligger vattentäkten i förhållande till bebyggelse?","Vattentäkten ligger huvudsakligen uppströms bebyggelse, dock påverkas det ytvatten som induceras av ovanliggande samhällets bebyggelse inklusive avloppsreningsverk."]
["B10"]
["B11"]
["B12","Skriv en Sammanfattande analys av avsnittet ovan:\n(Tips: Bryt rad genom Alt + Enter)","Grundvattentäkten är belägen på en isälvsavlagring.\nMarkmaterialet är inte skredbenäget. \nÖversvämningsrisken vid vattentäkten är låg.\nRisk föreligger för påverkan från uppströms liggande avloppsreningsverk och bebyggelse. "]
["C","Påverkanskällor och vattenskydd"]
["C1","Hur ser markanvändningen i tillrinningsområdet ut idag?","Jordbruksmark och viss bebyggelse",null,"Påverkan från bekämpningsmedel eller konstgödsel"]
["C2","Vilka potentiella föroreningskällor finns i tillrinningsområdet vilka åtgärder finns för att minska påverkan? Det kan vara bra att ha koll på åtminstone de större källorna.","Jordbruksmark med konstgödsel och bekämpningsmedel, utsläpp från avloppsreningsverk uppströms samt dagvatten (bebyggelse)",null,"Förorening pga bräddning av uppströms liggande avloppsreningsverk"]
["C3","Förekommer det områden med förorenad mark? ","Har inte inventerats. ","Hela tillrinningsområdet bör inventeras, dvs även områden som vid nuvarande uttag inte påverkar vattentäkten. ","Översvämning av jordbruksmark som leder till att vattentäkten påverkas. Huvudsakliga risker bedöms vara påverkan av mikrbiologiska föroreningar samt ökade halter näringsämnen. "]
["C4","Är det stor risk brand i tillrinningsområdet?","Okänt men bedöms som relativt låg pga att tillrinningsområdet till stora delar består av jordbruksmark."]
["C5","Är det stor risk för ras och skred i tillrinningsområdet?","Risk för ras och skred vid vattendragens slänter "]
["C6","Är det redan idag stor risk för översvämningar i tillrinningsområdet? Hur höga är vattennivåerna vid översvämning?","Risk för översvämning av markområden vid vattendrag som kan påverka den inducerade vattenmängden och vattenkvaliteten."]
["C7","Har vattentäkten ett bra skydd mot föroreningar genom aktuellt vattenskyddsområde och ändamålsenliga skyddsföreskrifter?","Vattenskyddsområde saknas","Vattenskyddsområde ska upprättas"]
["C8","Sker mätningar av vattenkvaliteten i tillrinningsområdet?","Nej, grundvattenrör saknas. ","Installera grundvattenrör. "]
["C9","Har det genomförts en screening av miljögifter inom tillrinningsområdet?","Nej, varken vattenprovtagning eller markprovtagning är genomförd. ","Genomför inventering av potentiella föroreningskällor. Vid behov bör en screening genomföras. "]
["C10"]
["C11","Skriv en Sammanfattande analys av avsnittet ovan:\n(Tips: Bryt rad genom Alt + Enter)","Tillrinningsområdet består till stora delar av jordbruksmark och det bedöms förekomma en föroreningsrisk med avseende på främst mikrobiologiska föroreningar från denna verksamhet. \nRisk för påverkan från avloppsreningsverk. \nVattenskyddsområde saknas."]
["D"," Vattennivåer och vattenföring"]
["D1"," Finns det några noterade trender för vattennivåer i uttagsbrunnarna? Min- och maxvärden? Finns årstidsvariationer?","Grundvattenytan ca 7-9 meter under markytan. Lägsta nivåer under sommaren. Generell trend med minskande grundvattennivåer i brunnarna.  ",null,"Vattenbrist pga naturligt sjunkande nivåer"]
["D2"," Finns det några mätpunkter i tillrinningsområdet? Finns det trender för vattennivåer och flöden? Min - och maxvärden? Finns årstidsvariationer?","Inga mätningar av grundvattennivåer i tillrinningsområdet. Inga trender sammanställts pga att inga mätningar av grundvattennivåer i tillrinningsområdet har genomförts.\n","Grundvattenrör bör sättas i tillrinningsområdet","Risk för påverkan på teknisk utrustning (pumpar) om brunnarna blir torra vid låga grundvattennivåer."]
["D3"," Finns det någon samvariation med SGUs mätningar i grundvattennätet?","Mätningar i brunnar visar att nivåerna samvarierar med nivåerna i SGUs mätrör som ligger i samma ås men ligger långt från vattentäkten.","Trender bör sammanställas när mätningar har genomförts. "]
["D4","Finns det risk för att vattendomen eller tillståndet inte kan följas till följd av förändrade hydrologiska mönster över året? Finns det ökad risk för dammhaveri (uppdämda sjöar)?","Tillstånd saknas"]
["D5","Finns det risk att pumpar och råvattenintag torrläggs eller översvämmas, eller påverkas negativt på annat sätt?","Några brunnar riskerar att gå torra under perioder med låga vattennivåer vilket kan påverka den tekniska utrustningen."]
["D6","Finns dammar, eller annan vattenreglering uppströms, och hur kan det påverka vattennivåerna? Hur stor volymreserv ger regleringen vid olika tidpunkter på året?","Nej"]
["D7","Finns egen reglering? ","Nej"]
["D8"]
["D9"]
["D10","Skriv en Sammanfattande analys av avsnittet ovan:\n(Tips: Bryt rad genom Alt + Enter)","Information om grundvattennivåer i tillrinningsområdet saknas och bör tas fram.\nDet föreligger en betydande risk  att brunnar blir torra under perioder med låga grundvattennivåer framförallt under perioder då det sammanfaller med stora uttag. Detta kan leda till vattenbrist. "]
["E"," Vattenkvalitet och vattentemperatur"]
["E1","Hur är rå- och dricksvattenkvaliteten idag?","Generellt bra vattenkvalitet. Höga halter järn och mangan som periodvis ligger över Livsmedelsverkets gränsvärde. ",null,"Försämrad vattenkvalitet som leder till att nuvarande reningsprocess blir otillräcklig."]
["E2","Vilket vattentemperaturspann finns idag?","Ca 4-15 grader. Varmt vatten under sommaren pga inducerad infiltration (tyder på kort transporttid mellan vattendrag och vattentäkt). "]
["E3","Finns det några trender i vattenkvalitet och vattentemperatur? Titta gärna på långa tidsserier.","Svagt ökande färgtal."]
["E4","Hur ser min- och maxvärden ut?","Redovisas i grafer i exceldokumentet \"Vattenkvalitet Grusstad\". "]
["E5","Har årsvariationerna förändrats över tid?","Inga tydliga trender utöver en generell ökning av färgtalet. "]
["E6","Finns det risk att gränsvären överskrids?","Ja, järn och manganhalter överskrider gränsvärdena periodvis. "]
["E7","Fungerar vattenberedningen tillfredsställande idag och kommer den att fungera i framtiden om trenderna håller i sig?","Fungerar bra i dagsläget. Om trenderna håller i sig kan det bli aktuellt med ytterligare reningssteg pga höga färgtal."]
["E8","Finns det några kända orsaker eller förklaringar till eventuella förändringar?","Ökad avrinning i tillrinningsområdet. Förändrad markanvändning."]
["E9","Finns det några korrelationer mellan grundvattennivåer och vattenkvalitet och/eller vattentemperatur som beror på olika geologiska, hydrogeologiska eller hydrologiska förhållanden?","Färgtalet generellt högre vid högvattenföring i ytvattendraget."]
["E10","Finns det kvalitetsskillnader i vattenresursen (årstidsvariationer eller långtidstrender)?","Ej känt, bör utredas. "]
["E11"]
["E12","Skriv en Sammanfattande analys av avsnittet ovan:\n(Tips: Bryt rad genom Alt + Enter)","Generellt bra vattenkvalitet men halterna järn, mangan och färgtal bör följas upp bättre. Järn och mangan ligger nära gränsvärdet och färgtalet uppvisar en ökande trend. "]
["F","Utformning av tekniskt vattenförsörjningssystem"]
["F1","Finns delar av en anläggning som ligger lågt i terrängen?","Vissa tryckstegringsstationer och ledningar","Se separat dokument med ledningskarta","Översvämning av tryckstegringsstationerna 56 och 32 som leder till fysisk påverkan på anläggningarna.  "]
["F2","Finns det ledningar i skredbenägna områden?","Troligtvis","Bör utredas"]
["F3","Vilket ekonomiskt värde har dricksvattenförsörjningssystemet? Bra att kunna visa för att motivera investeringar till skydd av vattenförsörjningen.","Värdet på vattentäkten har beräknats till ca 75 miljoner vilket är kostnaden att ersätta befintligt grundvattentäkt/-verk  med ytvattentäkt/-verk.  Det totala värdet på hela vattenförsörjningssystemet uppskattas överskrida 1 miljard."]
["F4","Finns det ledningar som korsar vattendrag eller raviner?","Ja, på flera ställen","Se separat dokument med ledningskarta"]
["F5","Finns det ledningar som ligger i förorenad mark och där någon förorening skulle kunna läcka in?","Förorenade områden har inte inventerats. Inga kända områden.","Förorenade områden bör utredas. "]
["F6"]
["F7","Skriv en Sammanfattande analys av avsnittet ovan:\n(Tips: Bryt rad genom Alt + Enter)","Det totala värdet på hela vattenförsörjningssystemet uppskattas överskrida 1 miljard.\nDet är av stor vikt att inventera och åtgärda kritiska punkter på ledningsnätet,  innan det sker någon yttre påverkan. "]
["G","Drifterfarenheter"]
["G1"," Har användningen och doseringen av kemikalier förändrats? Kan detta bero på klimatvariationer eller ett förändrat klimat?","Ja, kemikaliedoseringen har ökat pga ökade färgtal","Viktigt att följa upp vattenkvaliteten och intressant att göra korrelationer med klimat/väder och kemikaliedosering.  "]
["G2"," Har antalet drifttimmar eller behovet av underhåll ökat? Kan detta bero på klimatvariationer eller ett förändrat klimat?","Endast ökad kemikaliedosering."]
["G3"," Finns det några synliga trender för ökning av bräddningar, läckor, filtergenombrott, brunnar som sätter igen mm? Finns det några förklaringar till detta? Finns ett samband klimatvariationer eller väder?","Statistik av bräddningar på reningsverket sedan 2017. Ingen tydlig trend. Bräddningar sker ofta i samband med skyfall."]
["G4"," Har det förekommit perioder med begränsningar i vattenanvändning till följd av vattenbrist eller vattenkvalitetförsämringar? Har det förekommit bevattningsförbud? Har det förekommit råd om att koka vatten?","Ja, bevattningförbud har förekommit sommartid vid ett antal tillfällen. Kokningsrekommendationer vid ett tillfälle 2018 pga E-coli."]
["G5"]
["G6","Skriv en Sammanfattande analys av avsnittet ovan:\n(Tips: Bryt rad genom Alt + Enter)","Kemikaliedoseringen är ökande, vilket bör utredas och ev. åtgärdas."]

{"sheet":"2. Svar till Klimatfrågorna","index":2,"n_rows":81,"n_cols":5,"rows_kept":81,"cut":false,"hidden":false,"merged":[[80,2,80,4],[21,2,21,4],[33,2,33,4],[48,2,48,4],[62,2,62,4],[73,2,73,4]]}
[null,"Klimatanalys - svarsammanställning",{"$f":"Startsida!C6","v":"Grusstad"}]
[]
[]
[]
[]
[]
[]
[]
[null,"KLIMATANALYS"]
[null,"Frågor","Svar/sammanfattning","Kommentarer/utredningsbehov","Oönskade händelser"]
["H","Generella frågor"]
["H1","H1 Vilket klimat är det idag, till exempel max-, medel- och minimivärden eller oväder och torka?","I länsanalysen (SMHI) beskrivs identifierat nuläge.","Har läst igenom länsanalysen (SMHI)."]
["H2","Vilka erfarenheter av klimat och extrema väderhändelser finns i organisationen, till exempel ovanligt varma eller kalla säsonger, eller olika extrema vädersituationer som skyfall?","I driftpärmar förekommer dokumenterad erfarenhet av värmeböljor/torka som inneburit vattenbrist.  Det har även förekommit åsknedslag inom vattentäkten (muntlig info)",null,"Ökad risk för låga grundvattennivåer i samband med låga perioder med värmebölja"]
["H3","Hur har verksamheten påverkats av tidigare väderhändelser? Vad var konsekvenserna?","Perioder med skyfall har inneburit bräddning av avloppspumpstationer. Grannkommunen har reningsverket uppströms vattentäkten vilket kan innebära problem. Ingen påverkan av vattentäkten har identifierats hittills",null,"Bräddning av pumpstationer som leder till påverkan på vattenkvalitet. "]
["H4","Har problemen åtgärdats? Har det varit möjligt att utvärdera åtgärderna efteråt vid liknande situationer?","Inga åtgärder har vidtagits.",null,"Avloppspåverkan från grannkommunens avloppsreningsverk på ytvattnet som påverkar grundvattenkvaliteten "]
["H5","Är det möjligt att identifiera kritiska tröskelvärden för när verksamheten störs? Har dessa tröskelvärden tidigare överskridits eller varit nära att överskridas?","Lägsta acceptabla grundvattennivå i respektive brunn finns dokumenterat i driftinstruktionen.  Värdena har underskridits vid ett antal tillfällen. "]
["H6","Påverkas verksamheten av andra mänskliga aktiviteter som kan tänkas ha en större påverkan än klimatförändringar? Till exempel befolkningsökning, markanvändning, hårdgjorda ytor.","Markanvändningen har ändras sedan vattentäkten togs i drift, framförallt ökad andel jordbruksmark."]
["H7","Vilka klimatförändringar som berör våra system kan ni vänta er i framtiden?","Översvämningar som leder till ras och skred samt  torka som leder till vattenbrist. Förändringar i vattenflöden som påverkar vattenkvaliteten. ",null,"Ras och skred som leder till ledningsbrott"]
["H8","Finns behov av att flytta eller utöka verksamheten? Förändras vattenbehoven i framtiden? Innebär det att ni behöver undersöka vattenförhållanden på andra platser?","I behov att utöka verksamheten, pga hög  vattenförbrukning under besöksnäringens högsäsong.  Vattenförbrukningen uppskattas att öka ytterligare.  ",null,"Försämrad råvattenkvalitet orsakad av förändrad vattenkvalitet i ån med avseende på organiskt material. "]
["H9","Vilka extremsituationer kan vi förvänta oss i dagens klimat?","Torka, extrema skyfall, åsknedslag, brand"]
[]
[null,"Skriv en Sammanfattande analys av avsnittet ovan:\n(Tips: Bryt rad genom Alt + Enter)","Utifrån länsanalysen samt egna erfarenheter identifieras huvudsakligen följande förändringar som  kan innebära problem för vattenförsörjningen.\n\n• ökad frekvens av värmeböljor  - är redan i dagsläget ett problem när det förekommer pga vattenbrist/hög förbrukning\n• ökad frekvens av extrem nederbörd- konstaterade problem bland annat bräddning av pumpstationer, samt försämrad råvattenkvalitet\n\n\n"]
["I","Temperatur"]
["I1","Hur kommer medeltemperaturen att förändras i området, för varje år och olika årstider?","Medeltemperaturen kommer att öka med ca 2%. Vintertemperaturen kommer att öka med ca 5 %."]
["I2","Påverkar temperaturförändringen vattentemperaturen?","Eftersom det sker en inducering av ytvatten till vattentäkten ökar sannolikt vattentemperaturen i vattentäkten.","Vattentemperaturen kan medföra problem på sommaren."]
["I3","Hur kan vattentemperaturen i vattentäkten bli under olika årstider i ett framtida klimat?","Generellt varmare under sommaren vilket bedöms öka i framtiden","Se temperaturkurvor för nuvarande vattentemperatur"]
["I4","Hur kommer förändringen av vattentemperaturen att påverka vattenkvaliteten?","Inte känt","Bör utredas"]
["I5","Vilka risker kan förändringen av vattentemperatur innebära för den tekniska vattenförsörjningsanläggningen?","Tillväxt av mikroorganismer i ledningar ",null,"Tillväxt av mikroorganismer i ledningar som leder till otjänligt vatten "]
["I6","Kommer vattentemperaturen i ledningsnätet att förändras om råvattnet blir varmare?  ","Ja, högst troligt. "]
["I7","Kommer vegetationsperioden att bli längre? Hur kan det i så fall påverka vatten-försörjningen?","Vegetetionsperioden förlängs vilket innebär att grundvattenbildningen minskas något. \nFler skördar kan leda till större påverkan på vattenkvaliteten pga högre markanvändning "]
["I8","Om antalet dagar med värmebölja ökar i framtiden, hur kan det påverka vattenförsörjningen?","Se ovan angående vattenbrist famförallt i samband med förhöjd förbrukning (även jordbruket)"]
[null,"Hur kan en förändrad temperatur påverka riskerna för förorening vid vattentäkten?","Ej känt."]
[]
[null,"Skriv en Sammanfattande analys av avsnittet ovan:\n(Tips: Bryt rad genom Alt + Enter)","Förlängd vegetationsperiod och längre perioder med torka samt ökad temperatur leder till följande:\n -ökad vattentemperatur \n- ökad risk för tillväxt av mikroorganiskmer i ledningar\n - minskad grundvattenbildning\n- försämrad vattenkvalitet"]
["J","Nederbörd och flöden"]
["J1","Hur har nederbörden varierat tidigare?","Mest nederbörd under hösten enligt data från SMHI. Stora skillnader mellan normalår och torrår. "]
["J2","Vilka erfarenheter finns av översvämningar?","Lokal översvämning av markområden har förekommit, bland annat vid tryckstegringsstation 56. ",null,"Översvämning av anläggningsdelar som leder till inläckage av ytvatten och därmed försämrad råvattenkvalitet. "]
["J3","Var de orsakade av skyfall eller översvämmade vattendrag?","Översvämmade vattendrag"]
["J4","Hur kommer nederbörden generellt att förändras? Titta på år och årstider.","Ingen större skillnad i medelnederbörd. Dock en ökad frekvens av extrema nederbördssituationer. "]
["J5","Förändras risken för skyfall?","Frekvensen skyfall ökar och de blir även intensivare. ","Enligt erfarenhet har skyfall inte medfört översvämningar. "]
["J6","Förändras risken för långvariga regn?","Ja, den ökar. "]
["J7","Förändras risken för höga flöden?","Nej."]
["J8","Förändras risken för översvämmade vattendrag?","Nej, risken för översvämmade vattendrag ökar inte då snösmälningen kommer att minska pga mindre snö. Viss risk för översvämning vid skyfall."]
["J9"," Förändras risken för längre perioder med torka?","Ja, risken för långa perioder med torka ökar. "]
["J10","Finns det översvämningskänsliga områden redan idag? ","Ja, det finns en del översvämningskänsliga områden.","En översvämningskartering bör genomföras. "]
["J11","Hur kan förändrade flöden påverka riskerna för förorening vid vattentäkten?","Risk för förändringar i vattenkvalitet. "]
["J12"]
[]
[null,"Skriv en Sammanfattande analys av avsnittet ovan:\n(Tips: Bryt rad genom Alt + Enter)","En ökad frekvens av extrema nederbördssituationer \nÖversvämmade vattendrag har förekommit. Risken för översvämningar vid snösmältning ökar inte med ett förändrat klimat.\n"]
["K","Vattentillgång -  Ytvatten"]
["K1","Hur har vattentillgången sett ut tidigare? ","Vattentillgången i ytvattendragen har inte uppmätts tidigare trots att det kan vara relevant då det påverkar induceringen till isälvsavlagringen.","Bör mätas/utredas. "]
["K2","Finns det erfarenheter av torka?","Nej, inte så mycket att ytvattenförekomsten torkat ut. ","Samvariationer mellan ytvattennivåer och grundvattennivåer bör utredas. "]
["K3","Hur kommer vattentillgången att bli generellt under året?","Mindre vattentillgång under snösmältningsperioden och under perioder med torka. "]
["K4","Hur förändras troligen vattendragens flödesmönster i framtiden?","Större vattentillgång under vintern men mindre flödestopp under snösmältningsperioden. "]
["K5","Får det konsekvenser för vattentillgången?","Troligtvis vissa konsekvenser på vattentillgången till grundvattenmagasinet. ","Samvariationer mellan ytvattennivåer och grundvattennivåer bör utredas. "]
["K6","Hur kommer ytvattenflödena att variera?","Variationerna kommer att vara stora pga fler tillfällen med skyfall och torka. Lägre snösmältningstopp. ","Måste utredas vidare"]
["K7","Hur kommer ytvattennivåerna att variera?","Variationerna kommer att vara stora pga fler tillfällen med skyfall och torka. Lägre snösmältningstopp. ","Måste utredas vidare"]
["K8","Finns risk för vattenbrist, och i så fall under hur lång tid? Finns det erfarenhet?","Nej, risk för vattenbrist i vattendraget bedöms vara liten","Samvariationer mellan ytvattenflöden och grundvattennivåer bör utredas. "]
["K9","Finns risker för kvalitetsförändringar av råvattnet?","Ja, pga varmare vatten och förändrade flöden. "]
["K10","Kommer antalet enskilda brunnar att minska och behovet av kommunalt vatten att öka?","Nej, i området är samtliga anslutna till kommunalt vatten."]
["K11"," Hur påverkas ev. reservvatten vid låg vattentillgång i en vattentäkt?","Reservvatten saknas."]
[]
[null,"Skriv en Sammanfattande analys av avsnittet ovan:\n(Tips: Bryt rad genom Alt + Enter)","Generellt dåligt med information om ytvattenförekomsten. \nRisken för att vattendraget översvämmas förekommer.\nRisken för minskade vattenflöden i samband med torka bedöms kunna påverka vattentäkten. Det kan förekomma kvalitetsförändringar som påverkar vattentäkten."]
["L","Vattentillgång - Grundvatten"]
["L1","Vilken mängd grundvatten bildas ett normalår?","Beräknat utifrån tillrinningsområdets storlek och nederbörd/avdunstning ca 450 000 m3/år. "]
["L2","Hur stor andel av grundvattenbildningen tas ut i vattentäkten?","Ca 25% utifrån normalt uttag. Större under sommaren."]
["L3","Vilken förändring i grundvattenbildningen kan förväntas med ett förändrat klimat?","Minskad grundvattenbildning under sommartid pga högre temperatur och en längre vegetationsperiod.  Viss ökning av grundvattenbildning under vintertid pga större andel nederbörd i form av vatten i stället för snö."]
["L4","Om inducering eller infiltration sker- hur förväntas vattentillgången och nivåer förändras i vattendragen?","Ja, inducering sker från vattendrag som går genom åsen. Se tidigare svar under ytvatten. "]
["L5","Hur kommer årstidsförändringarna se ut?","Variationerna kommer att vara stora pga fler tillfällen med skyfall och torka. Lägre snösmältningstopp. "]
["L6","Hur kommer grundvattennivåerna variera?","Grundvattenvivåerna bedöms sjunka under sommaren, pga längre perioder med torka. "]
["L7","Finns det risk för kvalitetsförändringar om grundvattennivån påverkas? ( i form av förorenade områden, ytvatten mm)","Okänt","Bör utredas. "]
["L8","Finns det områden med enskilt vatten som kan påverkas av förändringar i grundvattennivån? (i form av minskad tillgång, saltvatteninträngning, högre halter av järn eller mangan mm)","Nej, i området är samtliga anslutna till kommunalt vatten."]
[]
[null,"Skriv en Sammanfattande analys av avsnittet ovan:\n(Tips: Bryt rad genom Alt + Enter)","Grundvattenbildningen är generellt betydligt större än medeluttaget. Under sommaren är dock grundvattenbildningen liten och vattenuttaget som störst vilket kan innebära att grundvattennivåerna är så låga att det kan medföra kapacitetsbrist. Har redan skett idag och risken ökar i samband med klimatförändringarna."]
["M","Havsnivå"]
["M1","Var förutspås havsnivån att ligga i framtiden?","Inte relevant i denna vattentäkt, pga ej havsnära."]
["M2","Vilka anläggningsdelar eller delar av tillrinningsområdet ligger under den framtida förmodade havsnivån?","Se ovan"]
["M3","Kan en förändrad havsnivå påverka grundvattenkvaliteten i området? Vilka områden är känsliga?","Se ovan"]
["M4","M4 Hur kan en förändrad havsnivå påverka riskerna (för erosion, ras, skred) och riskerna för  förorening vid vattentäkten? ","Se ovan"]
["M5","Vilka erfarenheter finns av översvämningar?","Se ovan"]
[null,"Skriv en Sammanfattande analys av avsnittet ovan:\n(Tips: Bryt rad genom Alt + Enter)","Ej relevant. "]

{"sheet":"3. Sammanfattande analys","index":3,"n_rows":23,"n_cols":3,"rows_kept":23,"cut":false,"hidden":false,"merged":[]}
["Sammanfattning av System- och Klimatanalysen"]
[]
["Anläggning:",{"$f":"Startsida!C6","v":"Grusstad"}]
["Datum:",{"$f":"Startsida!C7","v":"2019-01-29"}]
["Deltagare:",{"$f":"Startsida!C8","v":0}]
[]
[]
["Del:","Systemanalys:","Sammanfattande analys"]
["A"," Vattenkapacitet och vattenbehov",{"$f":"'1. Svar till systemfrågorna'!C20:E20","v":"Normal förbrukning klarar vattentäktens kapacitet. Under högsäsong kan det i framtiden bli problem med kapaciteten då det redan i dagsläget är liten marginal och besöksnäringen ökar. Risk för vattenbrist under högsäsong."}]
["B","Markförhållanden",{"$f":"'1. Svar till systemfrågorna'!C33:E33","v":"Grundvattentäkten är belägen på en isälvsavlagring.\nMarkmaterialet är inte skredbenäget. \nÖversvämningsrisken vid vattentäkten är låg.\nRisk föreligger för påverkan från uppströms liggande avloppsreningsverk och bebyggelse. "}]
["C","Påverkanskällor och vattenskydd",{"$f":"'1. Svar till systemfrågorna'!C45:E45","v":"Tillrinningsområdet består till stora delar av jordbruksmark och det bedöms förekomma en föroreningsrisk med avseende på främst mikrobiologiska föroreningar från denna verksamhet. \nRisk för påverkan från avloppsreningsverk. \nVattenskyddsområde saknas."}]
["D"," Vattennivåer och vattenföring",{"$f":"'1. Svar till systemfrågorna'!C56:E56","v":"Information om grundvattennivåer i tillrinningsområdet saknas och bör tas fram.\nDet föreligger en betydande risk  att brunnar blir torra under perioder med låga grundvattennivåer framförallt under perioder då det sammanfaller med stora uttag. Detta kan leda till vattenbrist. "}]
["E"," Vattenkvalitet och vattentemperatur",{"$f":"'1. Svar till systemfrågorna'!C69:E69","v":"Generellt bra vattenkvalitet men halterna järn, mangan och färgtal bör följas upp bättre. Järn och mangan ligger nära gränsvärdet och färgtalet uppvisar en ökande trend. "}]
["F","Utformning av tekniskt vattenförsörjningssystem",{"$f":"'1. Svar till systemfrågorna'!C77:E77","v":"Det totala värdet på hela vattenförsörjningssystemet uppskattas överskrida 1 miljard.\nDet är av stor vikt att inventera och åtgärda kritiska punkter på ledningsnätet,  innan det sker någon yttre påverkan. "}]
["G","Drifterfarenheter",{"$f":"'1. Svar till systemfrågorna'!C84:E84","v":"Kemikaliedoseringen är ökande, vilket bör utredas och ev. åtgärdas."}]
[]
["Del:","Klimatanalys:","Sammanfattande analys"]
["H","Generella frågor",{"$f":"'2. Svar till Klimatfrågorna'!C22:E22","v":"Utifrån länsanalysen samt egna erfarenheter identifieras huvudsakligen följande förändringar som  kan innebära problem för vattenförsörjningen.\n\n• ökad frekvens av värmeböljor  - är redan i dagsläget ett problem när det förekommer pga vattenbrist/hög förbrukning\n• ökad frekvens av extrem nederbörd- konstaterade problem bland annat bräddning av pumpstationer, samt försämrad råvattenkvalitet\n\n\n"}]
["I","Temperatur",{"$f":"'2. Svar till Klimatfrågorna'!C34:E34","v":"Förlängd vegetationsperiod och längre perioder med torka samt ökad temperatur leder till följande:\n -ökad vattentemperatur \n- ökad risk för tillväxt av mikroorganiskmer i ledningar\n - minskad grundvattenbildning\n- försämrad vattenkvalitet"}]
["J","Nederbörd och flöden",{"$f":"'2. Svar till Klimatfrågorna'!C49:E49","v":"En ökad frekvens av extrema nederbördssituationer \nÖversvämmade vattendrag har förekommit. Risken för översvämningar vid snösmältning ökar inte med ett förändrat klimat.\n"}]
["K","Vattentillgång -  Ytvatten",{"$f":"'2. Svar till Klimatfrågorna'!C63:E63","v":"Generellt dåligt med information om ytvattenförekomsten. \nRisken för att vattendraget översvämmas förekommer.\nRisken för minskade vattenflöden i samband med torka bedöms kunna påverka vattentäkten. Det kan förekomma kvalitetsförändringar som påverkar vattentäkten."}]
["L","Vattentillgång - Grundvatten",{"$f":"'2. Svar till Klimatfrågorna'!C74:E74","v":"Grundvattenbildningen är generellt betydligt större än medeluttaget. Under sommaren är dock grundvattenbildningen liten och vattenuttaget som störst vilket kan innebära att grundvattennivåerna är så låga att det kan medföra kapacitetsbrist. Har redan skett idag och risken ökar i samband med klimatförändringarna."}]
["M","Havsnivå",{"$f":"'2. Svar till Klimatfrågorna'!C81:E81","v":"Ej relevant. "}]

{"sheet":"4. Oönskade händelser","index":4,"n_rows":155,"n_cols":8,"rows_kept":155,"cut":false,"hidden":false,"merged":[[8,5,8,6],[8,1,8,3],[6,0,6,3]]}
["Oönskade händelser utifrån systemanalys och klimatanalys",null,{"$f":"Startsida!C6","v":"Grusstad"}]
[]
[]
[]
[]
[]
["Oönskade händelser från system- och klimatanalys",null,null,null,"Klimatanalys"]
[]
["Kommer ni på en oönskad händelse i denna del gå tillbaka till \"svar till\" flikarna 1 och 2 och fyll i där de passar bäst. Börja om med att \"uppdatera\" för att denna flik oönskade händelser skall vara uppdaterad.","Förekommer/förutspås händelsen (ja eller nej)",null,null,"Klimatfaktorer som kan påverka den oönskade händelsen. Som exempel kan värmebölja, vattenbrist, översvämning vara en klimatfaktor. Det kan finnas mer än en klimatfaktor.","Påverkan från klimatförändringar (0=ingen eller positiv, 1=märkbar negativ, 2=tydlig negativ)"]
["Oönskade händelser från systemfrågor","Nuläge"," 20 år"," 70 år","Klimatfaktor","20 år","70 år","Kommentarer"]
[{"$f":"'1. Svar till systemfrågorna'!E11","v":"Vattenbrist under perioder med stora vattenutttag, vilket ofta sammanfaller med perioder med låga grundvattennivåer (sommaren)."},"nej","ja","ja","Längre torrperioder, högre temperatur",1,2]
[{"$f":"'1. Svar till systemfrågorna'!E12","v":"Eftersom tillstånd inte finns föreligger risk att andra verksamheter, exempelvis jordbruk, ökar uttag och därmed ger sänkta vattennivåer som kan leda till vattenbrist."},"ja","ja","ja","Längre torrperioder, högre temperatur",1,2]
[{"$f":"'1. Svar till systemfrågorna'!E13","v":0},"nej","ja","ja","Perioder med extremnederbörd blir vanligare"]
[{"$f":"'1. Svar till systemfrågorna'!E14","v":0},"nej","ja","ja","Längre torrperioder, högre temperatur"]
[{"$f":"'1. Svar till systemfrågorna'!E15","v":0},"ja","ja","ja","Längre torrperioder, högre temperatur"]
[{"$f":"'1. Svar till systemfrågorna'!E16","v":0},"nej","nej","ja","Längre torrperioder, högre temperatur"]
[{"$f":"'1. Svar till systemfrågorna'!E17","v":0},"ja","ja","ja","Perioder med extremnederbörd blir vanligare"]
[{"$f":"'1. Svar till systemfrågorna'!E18","v":0},"nej","ja","ja"]
[{"$f":"'1. Svar till systemfrågorna'!E19","v":0}]
[{"$f":"'1. Svar till systemfrågorna'!E20","v":0}]
[{"$f":"'1. Svar till systemfrågorna'!E21","v":0}]
[{"$f":"'1. Svar till systemfrågorna'!E22","v":0}]
[{"$f":"'1. Svar till systemfrågorna'!E23","v":0}]
[{"$f":"'1. Svar till systemfrågorna'!E24","v":0}]
[{"$f":"'1. Svar till systemfrågorna'!E25","v":0}]
[{"$f":"'1. Svar till systemfrågorna'!E26","v":0}]
[{"$f":"'1. Svar till systemfrågorna'!E27","v":0}]
[{"$f":"'1. Svar till systemfrågorna'!E28","v":0}]
[{"$f":"'1. Svar till systemfrågorna'!E29","v":0}]
[{"$f":"'1. Svar till systemfrågorna'!E30","v":0}]
[{"$f":"'1. Svar till systemfrågorna'!E31","v":0}]
[{"$f":"'1. Svar till systemfrågorna'!E32","v":0}]
[{"$f":"'1. Svar till systemfrågorna'!E33","v":0}]
[{"$f":"'1. Svar till systemfrågorna'!E34","v":0}]
[{"$f":"'1. Svar till systemfrågorna'!E35","v":"Påverkan från bekämpningsmedel eller konstgödsel"},"nej","ja","ja","Perioder med extremnederbörd blir vanligare",1,1]
[{"$f":"'1. Svar till systemfrågorna'!E36","v":"Förorening pga bräddning av uppströms liggande avloppsreningsverk"},"nej","ja","ja","Perioder med extremnederbörd blir vanligare",2,2]
[{"$f":"'1. Svar till systemfrågorna'!E37","v":"Översvämning av jordbruksmark som leder till att vattentäkten påverkas. Huvudsakliga risker bedöms vara påverkan av mikrbiologiska föroreningar samt ökade halter näringsämnen. "},"ja","ja","ja","Perioder med extremnederbörd blir vanligare",1,2]
[{"$f":"'1. Svar till systemfrågorna'!E38","v":0}]
[{"$f":"'1. Svar till systemfrågorna'!E39","v":0}]
[{"$f":"'1. Svar till systemfrågorna'!E40","v":0}]
[{"$f":"'1. Svar till systemfrågorna'!E41","v":0}]
[{"$f":"'1. Svar till systemfrågorna'!E42","v":0}]
[{"$f":"'1. Svar till systemfrågorna'!E43","v":0}]
[{"$f":"'1. Svar till systemfrågorna'!E44","v":0}]
[{"$f":"'1. Svar till systemfrågorna'!E45","v":0}]
[{"$f":"'1. Svar till systemfrågorna'!E46","v":0}]
[{"$f":"'1. Svar till systemfrågorna'!E47","v":"Vattenbrist pga naturligt sjunkande nivåer"},"nej","nej","ja","Längre torrperioder, högre temperatur",0,1]
[{"$f":"'1. Svar till systemfrågorna'!E48","v":"Risk för påverkan på teknisk utrustning (pumpar) om brunnarna blir torra vid låga grundvattennivåer."},"ja","ja","ja","Längre torrperioder, högre temperatur",1,2]
[{"$f":"'1. Svar till systemfrågorna'!E49","v":0}]
[{"$f":"'1. Svar till systemfrågorna'!E50","v":0}]
[{"$f":"'1. Svar till systemfrågorna'!E51","v":0}]
[{"$f":"'1. Svar till systemfrågorna'!E52","v":0}]
[{"$f":"'1. Svar till systemfrågorna'!E53","v":0}]
[{"$f":"'1. Svar till systemfrågorna'!E54","v":0}]
[{"$f":"'1. Svar till systemfrågorna'!E55","v":0}]
[{"$f":"'1. Svar till systemfrågorna'!E56","v":0}]
[{"$f":"'1. Svar till systemfrågorna'!E57","v":0}]
[{"$f":"'1. Svar till systemfrågorna'!E58","v":"Försämrad vattenkvalitet som leder till att nuvarande reningsprocess blir otillräcklig."},"nej","ja","ja","Längre torrperioder, högre temperatur",1,1]
[{"$f":"'1. Svar till systemfrågorna'!E59","v":0}]
[{"$f":"'1. Svar till systemfrågorna'!E60","v":0}]
[{"$f":"'1. Svar till systemfrågorna'!E61","v":0}]
[{"$f":"'1. Svar till systemfrågorna'!E62","v":0}]
[{"$f":"'1. Svar till systemfrågorna'!E63","v":0}]
[{"$f":"'1. Svar till systemfrågorna'!E64","v":0}]
[{"$f":"'1. Svar till systemfrågorna'!E65","v":0}]
[{"$f":"'1. Svar till systemfrågorna'!E66","v":0}]
[{"$f":"'1. Svar till systemfrågorna'!E67","v":0}]
[{"$f":"'1. Svar till systemfrågorna'!E68","v":0}]
[{"$f":"'1. Svar till systemfrågorna'!E69","v":0}]
[{"$f":"'1. Svar till systemfrågorna'!E70","v":0}]
[{"$f":"'1. Svar till systemfrågorna'!E71","v":"Översvämning av tryckstegringsstationerna 56 och 32 som leder till fysisk påverkan på anläggningarna.  "},"ja","ja","ja","Perioder med extremnederbörd blir vanligare",1,1]
[{"$f":"'1. Svar till systemfrågorna'!E72","v":0}]
[{"$f":"'1. Svar till systemfrågorna'!E73","v":0}]
[{"$f":"'1. Svar till systemfrågorna'!E74","v":0}]
[{"$f":"'1. Svar till systemfrågorna'!E75","v":0}]
[{"$f":"'1. Svar till systemfrågorna'!E76","v":0}]
[{"$f":"'1. Svar till systemfrågorna'!E77","v":0}]
[{"$f":"'1. Svar till systemfrågorna'!E78","v":0}]
[{"$f":"'1. Svar till systemfrågorna'!E79","v":0}]
[{"$f":"'1. Svar till systemfrågorna'!E80","v":0}]
[{"$f":"'1. Svar till systemfrågorna'!E81","v":0}]
[{"$f":"'1. Svar till systemfrågorna'!E82","v":0}]
[{"$f":"'1. Svar till systemfrågorna'!E83","v":0}]
[{"$f":"'1. Svar till systemfrågorna'!E84","v":0}]
["Oönskade händelser från klimatfrågor","Nuläge"," 20 år"," 70 år","Klimatfaktor","20 år","70 år","Kommentar"]
[{"$f":"'2. Svar till Klimatfrågorna'!E12","v":0}]
[{"$f":"'2. Svar till Klimatfrågorna'!E13","v":"Ökad risk för låga grundvattennivåer i samband med låga perioder med värmebölja"},"ja","ja","ja","Längre torrperioder, högre temperatur",1,2]
[{"$f":"'2. Svar till Klimatfrågorna'!E14","v":"Bräddning av pumpstationer som leder till påverkan på vattenkvalitet. "},"ja","ja","ja","Perioder med extremnederbörd blir vanligare",1,1]
[{"$f":"'2. Svar till Klimatfrågorna'!E15","v":"Avloppspåverkan från grannkommunens avloppsreningsverk på ytvattnet som påverkar grundvattenkvaliteten "},"nej","ja","ja","Perioder med extremnederbörd blir vanligare",1,1]
[{"$f":"'2. Svar till Klimatfrågorna'!E16","v":0}]
[{"$f":"'2. Svar till Klimatfrågorna'!E17","v":0}]
[{"$f":"'2. Svar till Klimatfrågorna'!E18","v":"Ras och skred som leder till ledningsbrott"},"ja","ja","ja","Perioder med extremnederbörd blir vanligare",1,1]
[{"$f":"'2. Svar till Klimatfrågorna'!E19","v":"Försämrad råvattenkvalitet orsakad av förändrad vattenkvalitet i ån med avseende på organiskt material. "},"nej","ja","ja","Perioder med extremnederbörd blir vanligare",1,2]
[{"$f":"'2. Svar till Klimatfrågorna'!E20","v":0}]
[{"$f":"'2. Svar till Klimatfrågorna'!E21","v":0}]
[{"$f":"'2. Svar till Klimatfrågorna'!E22","v":0}]
[{"$f":"'2. Svar till Klimatfrågorna'!E23","v":0}]
[{"$f":"'2. Svar till Klimatfrågorna'!E24","v":0}]
[{"$f":"'2. Svar till Klimatfrågorna'!E25","v":0}]
[{"$f":"'2. Svar till Klimatfrågorna'!E26","v":0}]
[{"$f":"'2. Svar till Klimatfrågorna'!E27","v":0}]
[{"$f":"'2. Svar till Klimatfrågorna'!E28","v":"Tillväxt av mikroorganismer i ledningar som leder till otjänligt vatten "},"nej","ja","ja","Högre vattentemperatur",1,2]
[{"$f":"'2. Svar till Klimatfrågorna'!E29","v":0}]
[{"$f":"'2. Svar till Klimatfrågorna'!E30","v":0}]
[{"$f":"'2. Svar till Klimatfrågorna'!E31","v":0}]
[{"$f":"'2. Svar till Klimatfrågorna'!E32","v":0}]
[{"$f":"'2. Svar till Klimatfrågorna'!E33","v":0}]
[{"$f":"'2. Svar till Klimatfrågorna'!E34","v":0}]
[{"$f":"'2. Svar till Klimatfrågorna'!E35","v":0}]
[{"$f":"'2. Svar till Klimatfrågorna'!E36","v":0}]
[{"$f":"'2. Svar till Klimatfrågorna'!E37","v":"Översvämning av anläggningsdelar som leder till inläckage av ytvatten och därmed försämrad råvattenkvalitet. "},"nej","ja","ja","Perioder med extremnederbörd blir vanligare",1,1]
[{"$f":"'2. Svar till Klimatfrågorna'!E38","v":0}]
[{"$f":"'2. Svar till Klimatfrågorna'!E39","v":0}]
[{"$f":"'2. Svar till Klimatfrågorna'!E40","v":0}]
[{"$f":"'2. Svar till Klimatfrågorna'!E41","v":0}]
[{"$f":"'2. Svar till Klimatfrågorna'!E42","v":0}]
[{"$f":"'2. Svar till Klimatfrågorna'!E43","v":0}]
[{"$f":"'2. Svar till Klimatfrågorna'!E44","v":0}]
[{"$f":"'2. Svar till Klimatfrågorna'!E45","v":0}]
[{"$f":"'2. Svar till Klimatfrågorna'!E46","v":0}]
[{"$f":"'2. Svar till Klimatfrågorna'!E47","v":0}]
[{"$f":"'2. Svar till Klimatfrågorna'!E49","v":0}]
[{"$f":"'2. Svar till Klimatfrågorna'!E50","v":0}]
[{"$f":"'2. Svar till Klimatfrågorna'!E51","v":0}]
[{"$f":"'2. Svar till Klimatfrågorna'!E52","v":0}]
[{"$f":"'2. Svar till Klimatfrågorna'!E53","v":0}]
[{"$f":"'2. Svar till Klimatfrågorna'!E54","v":0}]
[{"$f":"'2. Svar till Klimatfrågorna'!E55","v":0}]
[{"$f":"'2. Svar till Klimatfrågorna'!E56","v":0}]
[{"$f":"'2. Svar till Klimatfrågorna'!E57","v":0}]
[{"$f":"'2. Svar till Klimatfrågorna'!E58","v":0}]
[{"$f":"'2. Svar till Klimatfrågorna'!E59","v":0}]
[{"$f":"'2. Svar till Klimatfrågorna'!E60","v":0}]
[{"$f":"'2. Svar till Klimatfrågorna'!E61","v":0}]
[{"$f":"'2. Svar till Klimatfrågorna'!E62","v":0}]
[{"$f":"'2. Svar till Klimatfrågorna'!E63","v":0}]
[{"$f":"'2. Svar till Klimatfrågorna'!E64","v":0}]
[{"$f":"'2. Svar till Klimatfrågorna'!E65","v":0}]
[{"$f":"'2. Svar till Klimatfrågorna'!E66","v":0}]
[{"$f":"'2. Svar till Klimatfrågorna'!E67","v":0}]
[{"$f":"'2. Svar till Klimatfrågorna'!E68","v":0}]
[{"$f":"'2. Svar till Klimatfrågorna'!E69","v":0}]
[{"$f":"'2. Svar till Klimatfrågorna'!E70","v":0}]
[{"$f":"'2. Svar till Klimatfrågorna'!E71","v":0}]
[{"$f":"'2. Svar till Klimatfrågorna'!E72","v":0}]
[{"$f":"'2. Svar till Klimatfrågorna'!E73","v":0}]
[{"$f":"'2. Svar till Klimatfrågorna'!E74","v":0}]
[{"$f":"'2. Svar till Klimatfrågorna'!E75","v":0}]
[{"$f":"'2. Svar till Klimatfrågorna'!E76","v":0}]
[{"$f":"'2. Svar till Klimatfrågorna'!E77","v":0}]
[{"$f":"'2. Svar till Klimatfrågorna'!E78","v":0}]
[{"$f":"'2. Svar till Klimatfrågorna'!E79","v":0}]
[{"$f":"'2. Svar till Klimatfrågorna'!E80","v":0}]
[{"$f":"'2. Svar till Klimatfrågorna'!E81","v":0}]
[{"$f":"'2. Svar till Klimatfrågorna'!E82","v":0}]

{"sheet":"5. Riskanalys","index":5,"n_rows":296,"n_cols":14,"rows_kept":296,"cut":false,"hidden":false,"merged":[[294,0,295,0],[294,1,295,1],[294,3,295,3],[294,5,295,5],[288,0,289,0],[288,1,289,1],[288,3,289,3],[288,5,289,5],[290,0,291,0],[290,1,291,1],[290,3,291,3],[290,5,291,5],[292,0,293,0],[292,1,293,1],[292,3,293,3],[292,5,293,5],[282,0,283,0],[282,1,283,1],[282,3,283,3],[282,5,283,5],[284,0,285,0],[284,1,285,1],[284,3,285,3],[284,5,285,5],[286,0,287,0],[286,1,287,1],[286,3,287,3],[286,5,287,5],[276,0,277,0],[276,1,277,1],[276,3,277,3],[276,5,277,5],[278,0,279,0],[278,1,279,1],[278,3,279,3],[278,5,279,5],[280,0,281,0],[280,1,281,1],[280,3,281,3],[280,5,281,5],[270,0,271,0],[270,1,271,1],[270,3,271,3],[270,5,271,5],[272,0,273,0],[272,1,273,1],[272,3,273,3],[272,5,273,5],[274,0,275,0],[274,1,275,1],[274,3,275,3],[274,5,275,5],[264,0,265,0],[264,1,265,1],[264,3,265,3],[264,5,265,5],[266,0,267,0],[266,1,267,1],[266,3,267,3],[266,5,267,5],[268,0,269,0],[268,1,269,1],[268,3,269,3],[268,5,269,5],[258,0,259,0],[258,1,259,1],[258,3,259,3],[258,5,259,5],[260,0,261,0],[260,1,261,1],[260,3,261,3],[260,5,261,5],[262,0,263,0],[262,1,263,1],[262,3,263,3],[262,5,263,5],[252,0,253,0],[252,1,253,1],[252,3,253,3],[252,5,253,5],[254,0,255,0],[254,1,255,1],[254,3,255,3],[254,5,255,5],[256,0,257,0],[256,1,257,1],[256,3,257,3],[256,5,257,5],[246,0,247,0],[246,1,247,1],[246,3,247,3],[246,5,247,5],[248,0,249,0],[248,1,249,1],[248,3,249,3],[248,5,249,5],[250,0,251,0],[250,1,251,1],[250,3,251,3],[250,5,251,5],[240,0,241,0],[240,1,241,1],[240,3,241,3],[240,5,241,5],[242,0,243,0],[242,1,243,1],[242,3,243,3],[242,5,243,5],[244,0,245,0],[244,1,245,1],[244,3,245,3],[244,5,245,5],[234,0,235,0],[234,1,235,1],[234,3,235,3],[234,5,235,5],[236,0,237,0],[236,1,237,1],[236,3,237,3],[236,5,237,5],[238,0,239,0],[238,1,239,1],[238,3,239,3],[238,5,239,5],[228,0,229,0],[228,1,229,1],[228,3,229,3],[228,5,229,5],[230,0,231,0],[230,1,231,1],[230,3,231,3],[230,5,231,5],[232,0,233,0],[232,1,233,1],[232,3,233,3],[232,5,233,5],[222,0,223,0],[222,1,223,1],[222,3,223,3],[222,5,223,5],[224,0,225,0],[224,1,225,1],[224,3,225,3],[224,5,225,5],[226,0,227,0],[226,1,227,1],[226,3,227,3],[226,5,227,5],[216,0,217,0],[216,1,217,1],[216,3,217,3],[216,5,217,5],[218,0,219,0],[218,1,219,1],[218,3,219,3],[218,5,219,5],[220,0,221,0],[220,1,221,1],[220,3,221,3],[220,5,221,5],[210,0,211,0],[210,1,211,1],[210,3,211,3],[210,5,211,5],[212,0,213,0],[212,1,213,1],[212,3,213,3],[212,5,213,5],[214,0,215,0],[214,1,215,1],[214,3,215,3],[214,5,215,5],[204,0,205,0],[204,1,205,1],[204,3,205,3],[204,5,205,5],[206,0,207,0],[208,0,209,0],[208,1,209,1],[208,3,209,3],[208,5,209,5],[206,1,207,1],[206,3,207,3],[206,5,207,5],[198,0,199,0],[198,1,199,1],[198,3,199,3],[198,5,199,5],[200,0,201,0],[200,1,201,1],[200,3,201,3],[200,5,201,5],[202,0,203,0],[202,1,203,1],[202,3,203,3],[202,5,203,5],[192,0,193,0],[192,1,193,1],[192,3,193,3],[192,5,193,5],[194,0,195,0],[194,1,195,1],[194,3,195,3],[194,5,195,5],[196,0,197,0],[196,1,197,1],[196,3,197,3],[196,5,197,5],[186,0,187,0],[186,1,187,1],[186,3,187,3],[186,5,187,5],[188,0,189,0],[190,0,191,0],[190,1,191,1],[190,3,191,3],[190,5,191,5],[188,1,189,1],[188,3,189,3],[188,5,189,5],[180,0,181,0],[180,1,181,1],[180,3,181,3],[180,5,181,5],[182,0,183,0],[182,1,183,1],[182,3,183,3],[182,5,183,5],[184,0,185,0],[184,1,185,1],[184,3,185,3],[184,5,185,5],[174,0,175,0],[174,1,175,1],[174,3,175,3],[174,5,175,5],[176,0,177,0],[176,1,177,1],[176,3,177,3],[176,5,177,5],[178,0,179,0],[178,1,179,1],[178,3,179,3],[178,5,179,5],[168,0,169,0],[170,0,171,0],[170,1,171,1],[170,3,171,3],[170,5,171,5],[172,0,173,0],[172,1,173,1],[172,3,173,3],[172,5,173,5],[168,1,169,1],[168,3,169,3],[168,5,169,5],[162,0,163,0],[162,1,163,1],[162,3,163,3],[162,5,163,5],[164,0,165,0],[164,1,165,1],[164,3,165,3],[164,5,165,5],[166,0,167,0],[166,1,167,1],[166,3,167,3],[166,5,167,5],[158,0,159,0],[160,0,161,0],[153,0,154,0],[153,1,154,1],[153,3,154,3],[153,5,154,5],[156,0,157,0],[156,1,157,1],[156,3,157,3],[156,5,157,5],[158,1,159,1],[158,3,159,3],[158,5,159,5],[160,1,161,1],[160,3,161,3],[160,5,161,5],[149,0,150,0],[149,1,150,1],[149,3,150,3],[149,5,150,5],[151,0,152,0],[151,1,152,1],[151,3,152,3],[151,5,152,5],[145,0,146,0],[145,1,146,1],[145,3,146,3],[145,5,146,5],[147,0,148,0],[147,1,148,1],[147,3,148,3],[147,5,148,5],[141,0,142,0],[141,1,142,1],[141,3,142,3],[141,5,142,5],[143,0,144,0],[143,1,144,1],[143,3,144,3],[143,5,144,5],[137,0,138,0],[137,1,138,1],[137,3,138,3],[137,5,138,5],[139,0,140,0],[139,1,140,1],[139,3,140,3],[139,5,140,5],[133,0,134,0],[133,1,134,1],[133,3,134,3],[133,5,134,5],[135,0,136,0],[135,1,136,1],[135,3,136,3],[135,5,136,5],[129,0,130,0],[129,1,130,1],[129,3,130,3],[129,5,130,5],[131,0,132,0],[131,1,132,1],[131,3,132,3],[131,5,132,5],[125,0,126,0],[125,1,126,1],[125,3,126,3],[125,5,126,5],[127,0,128,0],[121,0,122,0],[121,1,122,1],[121,3,122,3],[121,5,122,5],[123,0,124,0],[123,1,124,1],[123,3,124,3],[123,5,124,5],[127,1,128,1],[127,3,128,3],[127,5,128,5],[117,0,118,0],[117,1,118,1],[117,3,118,3],[117,5,118,5],[119,0,120,0],[119,1,120,1],[119,3,120,3],[119,5,120,5],[113,0,114,0],[113,1,114,1],[113,3,114,3],[113,5,114,5],[115,0,116,0],[115,1,116,1],[115,3,116,3],[115,5,116,5],[109,0,110,0],[109,1,110,1],[109,3,110,3],[109,5,110,5],[111,0,112,0],[111,1,112,1],[111,3,112,3],[111,5,112,5],[105,0,106,0],[105,1,106,1],[105,3,106,3],[105,5,106,5],[107,0,108,0],[107,1,108,1],[107,3,108,3],[107,5,108,5],[101,0,102,0],[103,0,104,0],[103,1,104,1],[103,3,104,3],[103,5,104,5],[97,0,98,0],[97,1,98,1],[97,3,98,3],[97,5,98,5],[99,0,100,0],[99,1,100,1],[99,3,100,3],[99,5,100,5],[101,1,102,1],[101,3,102,3],[101,5,102,5],[93,0,94,0],[93,1,94,1],[93,3,94,3],[93,5,94,5],[95,0,96,0],[95,1,96,1],[95,3,96,3],[95,5,96,5],[89,0,90,0],[89,1,90,1],[89,3,90,3],[89,5,90,5],[91,0,92,0],[91,1,92,1],[91,3,92,3],[91,5,92,5],[85,0,86,0],[85,1,86,1],[85,3,86,3],[85,5,86,5],[87,0,88,0],[87,1,88,1],[87,3,88,3],[87,5,88,5],[81,0,82,0],[83,0,84,0],[83,1,84,1],[83,3,84,3],[83,5,84,5],[81,1,82,1],[81,3,82,3],[81,5,82,5],[77,0,78,0],[77,1,78,1],[77,3,78,3],[77,5,78,5],[79,0,80,0],[73,0,74,0],[73,1,74,1],[73,3,74,3],[73,5,74,5],[75,0,76,0],[75,1,76,1],[75,3,76,3],[75,5,76,5],[79,1,80,1],[79,3,80,3],[79,5,80,5],[69,0,70,0],[69,1,70,1],[69,3,70,3],[69,5,70,5],[71,0,72,0],[71,1,72,1],[71,3,72,3],[71,5,72,5],[65,0,66,0],[65,1,66,1],[65,3,66,3],[65,5,66,5],[67,0,68,0],[67,1,68,1],[67,3,68,3],[67,5,68,5],[61,0,62,0],[61,1,62,1],[61,3,62,3],[61,5,62,5],[63,0,64,0],[63,1,64,1],[63,3,64,3],[63,5,64,5],[57,0,58,0],[59,0,60,0],[57,1,58,1],[57,3,58,3],[57,5,58,5],[59,1,60,1],[59,3,60,3],[59,5,60,5],[53,0,54,0],[53,1,54,1],[53,3,54,3],[53,5,54,5],[55,0,56,0],[49,0,50,0],[49,1,50,1],[49,3,50,3],[49,5,50,5],[51,0,52,0],[51,1,52,1],[51,3,52,3],[51,5,52,5],[55,1,56,1],[55,3,56,3],[55,5,56,5],[45,0,46,0],[45,1,46,1],[45,3,46,3],[45,5,46,5],[47,0,48,0],[47,1,48,1],[47,3,48,3],[47,5,48,5],[39,5,40,5],[41,5,42,5],[43,5,44,5],[43,3,44,3],[41,3,42,3],[43,1,44,1],[39,1,40,1],[41,1,42,1],[39,3,40,3],[41,0,42,0],[43,0,44,0],[31,1,32,1],[33,3,34,3],[35,3,36,3],[37,3,38,3],[33,1,34,1],[35,1,36,1],[37,1,38,1],[23,5,24,5],[25,5,26,5],[27,5,28,5],[29,5,30,5],[31,5,32,5],[23,3,24,3],[25,3,26,3],[27,3,28,3],[29,3,30,3],[31,3,32,3],[25,1,26,1],[27,1,28,1],[23,1,24,1],[33,5,34,5],[35,5,36,5],[37,5,38,5],[29,1,30,1],[4,1,4,6],[11,3,12,3],[13,3,14,3],[15,3,16,3],[17,3,18,3],[19,3,20,3],[5,1,5,2],[5,3,5,4],[7,5,8,5],[7,1,8,1],[7,3,8,3],[9,1,10,1],[9,5,10,5],[9,3,10,3],[19,1,20,1],[13,1,14,1],[29,0,30,0],[31,0,32,0],[33,0,34,0],[35,0,36,0],[37,0,38,0],[39,0,40,0],[23,0,24,0],[25,0,26,0],[27,0,28,0],[0,1,0,6],[4,11,4,12],[5,11,5,12],[21,5,22,5],[15,0,16,0],[17,0,18,0],[19,0,20,0],[13,0,14,0],[11,1,12,1],[9,0,10,0],[11,0,12,0],[7,0,8,0],[11,5,12,5],[13,5,14,5],[15,5,16,5],[17,5,18,5],[19,5,20,5],[21,3,22,3],[21,0,22,0],[21,1,22,1],[4,7,4,10],[5,5,5,6],[15,1,16,1],[17,1,18,1]]}
["Riskanalys",{"$f":"Startsida!C6","v":"Grusstad"}]
[]
[]
[]
["Riskanalys","Sannolikhet (S) och konsekvens (K) \n- siffra 1-4",null,null,null,null,null,"Risk",null,null,null,"Till åtgärdsanalys"]
["Har ni glömt viktiga oönskade händelser - gå tillbaka till flikarna \"svar till\" flik 1 och 2 och fyll i på lämplig plats. Uppdatera flik 3 oönskade händelser innan ni \"uppdaterar lista\" på denna flik","Idag",null,"20 år",null,"70 år",null,null,"Idag","20 år","70 år"]
["Oönskade händelser Systemanalys","S","K","S","K","S","K",null,"Idag","20 år","70 år","Aut. \nUrval","Manuellt val","Filter"]
[{"$f":"'4. Oönskade händelser'!A11","v":"Vattenbrist under perioder med stora vattenutttag, vilket ofta sammanfaller med perioder med låga grundvattennivåer (sommaren)."},3,2,3,2,4,2,"Kvalitet",{"$f":"B8*(VLOOKUP(C8,Konsekvens,2,FALSE))","v":15},{"$f":"D8*(VLOOKUP(E8,Konsekvens,2,FALSE))","v":15},{"$f":"F8*(VLOOKUP(G8,Konsekvens,2,FALSE))","v":20},{"$f":"IFERROR(IF(I8>10,\"x\",IF(J8>10,\"x\",IF(K8>10,\"x\",\"\"))),\"\")","v":"x"},null,{"$f":"IF(A8=0,0,1)","v":1}]
[null,null,2,null,2,null,2,"Leverans",{"$f":"B8*(VLOOKUP(C9,Konsekvens,2,FALSE))","v":15},{"$f":"D8*(VLOOKUP(E9,Konsekvens,2,FALSE))","v":15},{"$f":"F8*(VLOOKUP(G9,Konsekvens,2,FALSE))","v":20},{"$f":"IFERROR(IF(I9>10,\"x\",IF(J9>10,\"x\",IF(K9>10,\"x\",\"\"))),\"\")","v":"x"},null,{"$f":"N8","v":1}]
[{"$f":"'4. Oönskade händelser'!A12","v":"Eftersom tillstånd inte finns föreligger risk att andra verksamheter, exempelvis jordbruk, ökar uttag och därmed ger sänkta vattennivåer som kan leda till vattenbrist."},1,2,2,2,2,2,"Kvalitet",{"$f":"B10*(VLOOKUP(C10,Konsekvens,2,FALSE))","v":5},{"$f":"D10*(VLOOKUP(E10,Konsekvens,2,FALSE))","v":10},{"$f":"F10*(VLOOKUP(G10,Konsekvens,2,FALSE))","v":10},"",null,{"$f":"IF(A10=0,0,1)","v":1}]
[null,null,1,null,1,null,1,"Leverans",{"$f":"B10*(VLOOKUP(C11,Konsekvens,2,FALSE))","v":1},{"$f":"D10*(VLOOKUP(E11,Konsekvens,2,FALSE))","v":2},{"$f":"F10*(VLOOKUP(G11,Konsekvens,2,FALSE))","v":2},"",null,{"$f":"N10","v":1}]
[{"$f":"'4. Oönskade händelser'!A13","v":0},null,null,null,null,null,null,"Kvalitet",{"$f":"B12*(VLOOKUP(C12,Konsekvens,2,FALSE))","v":{"$error":"#N/A"}},{"$f":"D12*(VLOOKUP(E12,Konsekvens,2,FALSE))","v":{"$error":"#N/A"}},{"$f":"F12*(VLOOKUP(G12,Konsekvens,2,FALSE))","v":{"$error":"#N/A"}},"",null,{"$f":"IF(A12=0,0,1)","v":0}]
[null,null,null,null,null,null,null,"Leverans",{"$f":"B12*(VLOOKUP(C13,Konsekvens,2,FALSE))","v":{"$error":"#N/A"}},{"$f":"D12*(VLOOKUP(E13,Konsekvens,2,FALSE))","v":{"$error":"#N/A"}},{"$f":"F12*(VLOOKUP(G13,Konsekvens,2,FALSE))","v":{"$error":"#N/A"}},"",null,{"$f":"N12","v":0}]
[{"$f":"'4. Oönskade händelser'!A14","v":0},null,null,null,null,null,null,"Kvalitet",{"$f":"B14*(VLOOKUP(C14,Konsekvens,2,FALSE))","v":{"$error":"#N/A"}},{"$f":"D14*(VLOOKUP(E14,Konsekvens,2,FALSE))","v":{"$error":"#N/A"}},{"$f":"F14*(VLOOKUP(G14,Konsekvens,2,FALSE))","v":{"$error":"#N/A"}},"",null,{"$f":"IF(A14=0,0,1)","v":0}]
[null,null,null,null,null,null,null,"Leverans",{"$f":"B14*(VLOOKUP(C15,Konsekvens,2,FALSE))","v":{"$error":"#N/A"}},{"$f":"D14*(VLOOKUP(E15,Konsekvens,2,FALSE))","v":{"$error":"#N/A"}},{"$f":"F14*(VLOOKUP(G15,Konsekvens,2,FALSE))","v":{"$error":"#N/A"}},"",null,{"$f":"N14","v":0}]
[{"$f":"'4. Oönskade händelser'!A15","v":0},null,null,null,null,null,null,"Kvalitet",{"$f":"B16*(VLOOKUP(C16,Konsekvens,2,FALSE))","v":{"$error":"#N/A"}},{"$f":"D16*(VLOOKUP(E16,Konsekvens,2,FALSE))","v":{"$error":"#N/A"}},{"$f":"F16*(VLOOKUP(G16,Konsekvens,2,FALSE))","v":{"$error":"#N/A"}},"",null,{"$f":"IF(A16=0,0,1)","v":0}]
[null,null,null,null,null,null,null,"Leverans",{"$f":"B16*(VLOOKUP(C17,Konsekvens,2,FALSE))","v":{"$error":"#N/A"}},{"$f":"D16*(VLOOKUP(E17,Konsekvens,2,FALSE))","v":{"$error":"#N/A"}},{"$f":"F16*(VLOOKUP(G17,Konsekvens,2,FALSE))","v":{"$error":"#N/A"}},"",null,{"$f":"N16","v":0}]
[{"$f":"'4. Oönskade händelser'!A16","v":0},null,null,null,null,null,null,"Kvalitet",{"$f":"B18*(VLOOKUP(C18,Konsekvens,2,FALSE))","v":{"$error":"#N/A"}},{"$f":"D18*(VLOOKUP(E18,Konsekvens,2,FALSE))","v":{"$error":"#N/A"}},{"$f":"F18*(VLOOKUP(G18,Konsekvens,2,FALSE))","v":{"$error":"#N/A"}},"",null,{"$f":"IF(A18=0,0,1)","v":0}]
[null,null,null,null,null,null,null,"Leverans",{"$f":"B18*(VLOOKUP(C19,Konsekvens,2,FALSE))","v":{"$error":"#N/A"}},{"$f":"D18*(VLOOKUP(E19,Konsekvens,2,FALSE))","v":{"$error":"#N/A"}},{"$f":"F18*(VLOOKUP(G19,Konsekvens,2,FALSE))","v":{"$error":"#N/A"}},"",null,{"$f":"N18","v":0}]
[{"$f":"'4. Oönskade händelser'!A17","v":0},null,null,null,null,null,null,"Kvalitet",{"$f":"B20*(VLOOKUP(C20,Konsekvens,2,FALSE))","v":{"$error":"#N/A"}},{"$f":"D20*(VLOOKUP(E20,Konsekvens,2,FALSE))","v":{"$error":"#N/A"}},{"$f":"F20*(VLOOKUP(G20,Konsekvens,2,FALSE))","v":{"$error":"#N/A"}},"",null,{"$f":"IF(A20=0,0,1)","v":0}]
[null,null,null,null,null,null,null,"Leverans",{"$f":"B20*(VLOOKUP(C21,Konsekvens,2,FALSE))","v":{"$error":"#N/A"}},{"$f":"D20*(VLOOKUP(E21,Konsekvens,2,FALSE))","v":{"$error":"#N/A"}},{"$f":"F20*(VLOOKUP(G21,Konsekvens,2,FALSE))","v":{"$error":"#N/A"}},"",null,{"$f":"N20","v":0}]
[{"$f":"'4. Oönskade händelser'!A18","v":0},null,null,null,null,null,null,"Kvalitet",{"$f":"B22*(VLOOKUP(C22,Konsekvens,2,FALSE))","v":{"$error":"#N/A"}},{"$f":"D22*(VLOOKUP(E22,Konsekvens,2,FALSE))","v":{"$error":"#N/A"}},{"$f":"F22*(VLOOKUP(G22,Konsekvens,2,FALSE))","v":{"$error":"#N/A"}},"",null,{"$f":"IF(A22=0,0,1)","v":0}]
[null,null,null,null,null,null,null,"Leverans",{"$f":"B22*(VLOOKUP(C23,Konsekvens,2,FALSE))","v":{"$error":"#N/A"}},{"$f":"D22*(VLOOKUP(E23,Konsekvens,2,FALSE))","v":{"$error":"#N/A"}},{"$f":"F22*(VLOOKUP(G23,Konsekvens,2,FALSE))","v":{"$error":"#N/A"}},"",null,{"$f":"N22","v":0}]
[{"$f":"'4. Oönskade händelser'!A19","v":0},null,null,null,null,null,null,"Kvalitet",{"$f":"B24*(VLOOKUP(C24,Konsekvens,2,FALSE))","v":{"$error":"#N/A"}},{"$f":"D24*(VLOOKUP(E24,Konsekvens,2,FALSE))","v":{"$error":"#N/A"}},{"$f":"F24*(VLOOKUP(G24,Konsekvens,2,FALSE))","v":{"$error":"#N/A"}},"",null,{"$f":"IF(A24=0,0,1)","v":0}]
[null,null,null,null,null,null,null,"Leverans",{"$f":"B24*(VLOOKUP(C25,Konsekvens,2,FALSE))","v":{"$error":"#N/A"}},{"$f":"D24*(VLOOKUP(E25,Konsekvens,2,FALSE))","v":{"$error":"#N/A"}},{"$f":"F24*(VLOOKUP(G25,Konsekvens,2,FALSE))","v":{"$error":"#N/A"}},"",null,{"$f":"N24","v":0}]
[{"$f":"'4. Oönskade händelser'!A20","v":0},null,null,null,null,null,null,"Kvalitet",{"$f":"B26*(VLOOKUP(C26,Konsekvens,2,FALSE))","v":{"$error":"#N/A"}},{"$f":"D26*(VLOOKUP(E26,Konsekvens,2,FALSE))","v":{"$error":"#N/A"}},{"$f":"F26*(VLOOKUP(G26,Konsekvens,2,FALSE))","v":{"$error":"#N/A"}},"",null,{"$f":"IF(A26=0,0,1)","v":0}]
[null,null,null,null,null,null,null,"Leverans",{"$f":"B26*(VLOOKUP(C27,Konsekvens,2,FALSE))","v":{"$error":"#N/A"}},{"$f":"D26*(VLOOKUP(E27,Konsekvens,2,FALSE))","v":{"$error":"#N/A"}},{"$f":"F26*(VLOOKUP(G27,Konsekvens,2,FALSE))","v":{"$error":"#N/A"}},"",null,{"$f":"N26","v":0}]
[{"$f":"'4. Oönskade händelser'!A21","v":0},null,null,null,null,null,null,"Kvalitet",{"$f":"B28*(VLOOKUP(C28,Konsekvens,2,FALSE))","v":{"$error":"#N/A"}},{"$f":"D28*(VLOOKUP(E28,Konsekvens,2,FALSE))","v":{"$error":"#N/A"}},{"$f":"F28*(VLOOKUP(G28,Konsekvens,2,FALSE))","v":{"$error":"#N/A"}},"",null,{"$f":"IF(A28=0,0,1)","v":0}]
[null,null,null,null,null,null,null,"Leverans",{"$f":"B28*(VLOOKUP(C29,Konsekvens,2,FALSE))","v":{"$error":"#N/A"}},{"$f":"D28*(VLOOKUP(E29,Konsekvens,2,FALSE))","v":{"$error":"#N/A"}},{"$f":"F28*(VLOOKUP(G29,Konsekvens,2,FALSE))","v":{"$error":"#N/A"}},"",null,{"$f":"N28","v":0}]
[{"$f":"'4. Oönskade händelser'!A22","v":0},null,null,null,null,null,null,"Kvalitet",{"$f":"B30*(VLOOKUP(C30,Konsekvens,2,FALSE))","v":{"$error":"#N/A"}},{"$f":"D30*(VLOOKUP(E30,Konsekvens,2,FALSE))","v":{"$error":"#N/A"}},{"$f":"F30*(VLOOKUP(G30,Konsekvens,2,FALSE))","v":{"$error":"#N/A"}},"",null,{"$f":"IF(A30=0,0,1)","v":0}]
[null,null,null,null,null,null,null,"Leverans",{"$f":"B30*(VLOOKUP(C31,Konsekvens,2,FALSE))","v":{"$error":"#N/A"}},{"$f":"D30*(VLOOKUP(E31,Konsekvens,2,FALSE))","v":{"$error":"#N/A"}},{"$f":"F30*(VLOOKUP(G31,Konsekvens,2,FALSE))","v":{"$error":"#N/A"}},"",null,{"$f":"N30","v":0}]
[{"$f":"'4. Oönskade händelser'!A23","v":0},null,null,null,null,null,null,"Kvalitet",{"$f":"B32*(VLOOKUP(C32,Konsekvens,2,FALSE))","v":{"$error":"#N/A"}},{"$f":"D32*(VLOOKUP(E32,Konsekvens,2,FALSE))","v":{"$error":"#N/A"}},{"$f":"F32*(VLOOKUP(G32,Konsekvens,2,FALSE))","v":{"$error":"#N/A"}},"",null,{"$f":"IF(A32=0,0,1)","v":0}]
[null,null,null,null,null,null,null,"Leverans",{"$f":"B32*(VLOOKUP(C33,Konsekvens,2,FALSE))","v":{"$error":"#N/A"}},{"$f":"D32*(VLOOKUP(E33,Konsekvens,2,FALSE))","v":{"$error":"#N/A"}},{"$f":"F32*(VLOOKUP(G33,Konsekvens,2,FALSE))","v":{"$error":"#N/A"}},"",null,{"$f":"N32","v":0}]
[{"$f":"'4. Oönskade händelser'!A24","v":0},null,null,null,null,null,null,"Kvalitet",{"$f":"B34*(VLOOKUP(C34,Konsekvens,2,FALSE))","v":{"$error":"#N/A"}},{"$f":"D34*(VLOOKUP(E34,Konsekvens,2,FALSE))","v":{"$error":"#N/A"}},{"$f":"F34*(VLOOKUP(G34,Konsekvens,2,FALSE))","v":{"$error":"#N/A"}},"",null,{"$f":"IF(A34=0,0,1)","v":0}]
[null,null,null,null,null,null,null,"Leverans",{"$f":"B34*(VLOOKUP(C35,Konsekvens,2,FALSE))","v":{"$error":"#N/A"}},{"$f":"D34*(VLOOKUP(E35,Konsekvens,2,FALSE))","v":{"$error":"#N/A"}},{"$f":"F34*(VLOOKUP(G35,Konsekvens,2,FALSE))","v":{"$error":"#N/A"}},"",null,{"$f":"N34","v":0}]
[{"$f":"'4. Oönskade händelser'!A25","v":0},null,null,null,null,null,null,"Kvalitet",{"$f":"B36*(VLOOKUP(C36,Konsekvens,2,FALSE))","v":{"$error":"#N/A"}},{"$f":"D36*(VLOOKUP(E36,Konsekvens,2,FALSE))","v":{"$error":"#N/A"}},{"$f":"F36*(VLOOKUP(G36,Konsekvens,2,FALSE))","v":{"$error":"#N/A"}},"",null,{"$f":"IF(A36=0,0,1)","v":0}]
[null,null,null,null,null,null,null,"Leverans",{"$f":"B36*(VLOOKUP(C37,Konsekvens,2,FALSE))","v":{"$error":"#N/A"}},{"$f":"D36*(VLOOKUP(E37,Konsekvens,2,FALSE))","v":{"$error":"#N/A"}},{"$f":"F36*(VLOOKUP(G37,Konsekvens,2,FALSE))","v":{"$error":"#N/A"}},"",null,{"$f":"N36","v":0}]
[{"$f":"'4. Oönskade händelser'!A26","v":0},null,null,null,null,null,null,"Kvalitet",{"$f":"B38*(VLOOKUP(C38,Konsekvens,2,FALSE))","v":{"$error":"#N/A"}},{"$f":"D38*(VLOOKUP(E38,Konsekvens,2,FALSE))","v":{"$error":"#N/A"}},{"$f":"F38*(VLOOKUP(G38,Konsekvens,2,FALSE))","v":{"$error":"#N/A"}},"",null,{"$f":"IF(A38=0,0,1)","v":0}]
[null,null,null,null,null,null,null,"Leverans",{"$f":"B38*(VLOOKUP(C39,Konsekvens,2,FALSE))","v":{"$error":"#N/A"}},{"$f":"D38*(VLOOKUP(E39,Konsekvens,2,FALSE))","v":{"$error":"#N/A"}},{"$f":"F38*(VLOOKUP(G39,Konsekvens,2,FALSE))","v":{"$error":"#N/A"}},"",null,{"$f":"N38","v":0}]
[{"$f":"'4. Oönskade händelser'!A27","v":0},null,null,null,null,null,null,"Kvalitet",{"$f":"B40*(VLOOKUP(C40,Konsekvens,2,FALSE))","v":{"$error":"#N/A"}},{"$f":"D40*(VLOOKUP(E40,Konsekvens,2,FALSE))","v":{"$error":"#N/A"}},{"$f":"F40*(VLOOKUP(G40,Konsekvens,2,FALSE))","v":{"$error":"#N/A"}},"",null,{"$f":"IF(A40=0,0,1)","v":0}]
[null,null,null,null,null,null,null,"Leverans",{"$f":"B40*(VLOOKUP(C41,Konsekvens,2,FALSE))","v":{"$error":"#N/A"}},{"$f":"D40*(VLOOKUP(E41,Konsekvens,2,FALSE))","v":{"$error":"#N/A"}},{"$f":"F40*(VLOOKUP(G41,Konsekvens,2,FALSE))","v":{"$error":"#N/A"}},"",null,{"$f":"N40","v":0}]
[{"$f":"'4. Oönskade händelser'!A28","v":0},null,null,null,null,null,null,"Kvalitet",{"$f":"B42*(VLOOKUP(C42,Konsekvens,2,FALSE))","v":{"$error":"#N/A"}},{"$f":"D42*(VLOOKUP(E42,Konsekvens,2,FALSE))","v":{"$error":"#N/A"}},{"$f":"F42*(VLOOKUP(G42,Konsekvens,2,FALSE))","v":{"$error":"#N/A"}},"",null,{"$f":"IF(A42=0,0,1)","v":0}]
[null,null,null,null,null,null,null,"Leverans",{"$f":"B42*(VLOOKUP(C43,Konsekvens,2,FALSE))","v":{"$error":"#N/A"}},{"$f":"D42*(VLOOKUP(E43,Konsekvens,2,FALSE))","v":{"$error":"#N/A"}},{"$f":"F42*(VLOOKUP(G43,Konsekvens,2,FALSE))","v":{"$error":"#N/A"}},"",null,{"$f":"N42","v":0}]
[{"$f":"'4. Oönskade händelser'!A29","v":0},null,null,null,null,null,null,"Kvalitet",{"$f":"B44*(VLOOKUP(C44,Konsekvens,2,FALSE))","v":{"$error":"#N/A"}},{"$f":"D44*(VLOOKUP(E44,Konsekvens,2,FALSE))","v":{"$error":"#N/A"}},{"$f":"F44*(VLOOKUP(G44,Konsekvens,2,FALSE))","v":{"$error":"#N/A"}},"",null,{"$f":"IF(A44=0,0,1)","v":0}]
[null,null,null,null,null,null,null,"Leverans",{"$f":"B44*(VLOOKUP(C45,Konsekvens,2,FALSE))","v":{"$error":"#N/A"}},{"$f":"D44*(VLOOKUP(E45,Konsekvens,2,FALSE))","v":{"$error":"#N/A"}},{"$f":"F44*(VLOOKUP(G45,Konsekvens,2,FALSE))","v":{"$error":"#N/A"}},"",null,{"$f":"N44","v":0}]
[{"$f":"'4. Oönskade händelser'!A30","v":0},null,null,null,null,null,null,"Kvalitet",{"$f":"B46*(VLOOKUP(C46,Konsekvens,2,FALSE))","v":{"$error":"#N/A"}},{"$f":"D46*(VLOOKUP(E46,Konsekvens,2,FALSE))","v":{"$error":"#N/A"}},{"$f":"F46*(VLOOKUP(G46,Konsekvens,2,FALSE))","v":{"$error":"#N/A"}},"",null,{"$f":"IF(A46=0,0,1)","v":0}]
[null,null,null,null,null,null,null,"Leverans",{"$f":"B46*(VLOOKUP(C47,Konsekvens,2,FALSE))","v":{"$error":"#N/A"}},{"$f":"D46*(VLOOKUP(E47,Konsekvens,2,FALSE))","v":{"$error":"#N/A"}},{"$f":"F46*(VLOOKUP(G47,Konsekvens,2,FALSE))","v":{"$error":"#N/A"}},"",null,{"$f":"N46","v":0}]
[{"$f":"'4. Oönskade händelser'!A31","v":0},null,null,null,null,null,null,"Kvalitet",{"$f":"B48*(VLOOKUP(C48,Konsekvens,2,FALSE))","v":{"$error":"#N/A"}},{"$f":"D48*(VLOOKUP(E48,Konsekvens,2,FALSE))","v":{"$error":"#N/A"}},{"$f":"F48*(VLOOKUP(G48,Konsekvens,2,FALSE))","v":{"$error":"#N/A"}},"",null,{"$f":"IF(A48=0,0,1)","v":0}]
[null,null,null,null,null,null,null,"Leverans",{"$f":"B48*(VLOOKUP(C49,Konsekvens,2,FALSE))","v":{"$error":"#N/A"}},{"$f":"D48*(VLOOKUP(E49,Konsekvens,2,FALSE))","v":{"$error":"#N/A"}},{"$f":"F48*(VLOOKUP(G49,Konsekvens,2,FALSE))","v":{"$error":"#N/A"}},"",null,{"$f":"N48","v":0}]
[{"$f":"'4. Oönskade händelser'!A32","v":0},null,null,null,null,null,null,"Kvalitet",{"$f":"B50*(VLOOKUP(C50,Konsekvens,2,FALSE))","v":{"$error":"#N/A"}},{"$f":"D50*(VLOOKUP(E50,Konsekvens,2,FALSE))","v":{"$error":"#N/A"}},{"$f":"F50*(VLOOKUP(G50,Konsekvens,2,FALSE))","v":{"$error":"#N/A"}},"",null,{"$f":"IF(A50=0,0,1)","v":0}]
[null,null,null,null,null,null,null,"Leverans",{"$f":"B50*(VLOOKUP(C51,Konsekvens,2,FALSE))","v":{"$error":"#N/A"}},{"$f":"D50*(VLOOKUP(E51,Konsekvens,2,FALSE))","v":{"$error":"#N/A"}},{"$f":"F50*(VLOOKUP(G51,Konsekvens,2,FALSE))","v":{"$error":"#N/A"}},"",null,{"$f":"N50","v":0}]
[{"$f":"'4. Oönskade händelser'!A33","v":0},null,null,null,null,null,null,"Kvalitet",{"$f":"B52*(VLOOKUP(C52,Konsekvens,2,FALSE))","v":{"$error":"#N/A"}},{"$f":"D52*(VLOOKUP(E52,Konsekvens,2,FALSE))","v":{"$error":"#N/A"}},{"$f":"F52*(VLOOKUP(G52,Konsekvens,2,FALSE))","v":{"$error":"#N/A"}},"",null,{"$f":"IF(A52=0,0,1)","v":0}]
[null,null,null,null,null,null,null,"Leverans",{"$f":"B52*(VLOOKUP(C53,Konsekvens,2,FALSE))","v":{"$error":"#N/A"}},{"$f":"D52*(VLOOKUP(E53,Konsekvens,2,FALSE))","v":{"$error":"#N/A"}},{"$f":"F52*(VLOOKUP(G53,Konsekvens,2,FALSE))","v":{"$error":"#N/A"}},"",null,{"$f":"N52","v":0}]
[{"$f":"'4. Oönskade händelser'!A34","v":0},null,null,null,null,null,null,"Kvalitet",{"$f":"B54*(VLOOKUP(C54,Konsekvens,2,FALSE))","v":{"$error":"#N/A"}},{"$f":"D54*(VLOOKUP(E54,Konsekvens,2,FALSE))","v":{"$error":"#N/A"}},{"$f":"F54*(VLOOKUP(G54,Konsekvens,2,FALSE))","v":{"$error":"#N/A"}},"",null,{"$f":"IF(A54=0,0,1)","v":0}]
[null,null,null,null,null,null,null,"Leverans",{"$f":"B54*(VLOOKUP(C55,Konsekvens,2,FALSE))","v":{"$error":"#N/A"}},{"$f":"D54*(VLOOKUP(E55,Konsekvens,2,FALSE))","v":{"$error":"#N/A"}},{"$f":"F54*(VLOOKUP(G55,Konsekvens,2,FALSE))","v":{"$error":"#N/A"}},"",null,{"$f":"N54","v":0}]
[{"$f":"'4. Oönskade händelser'!A35","v":"Påverkan från bekämpningsmedel eller konstgödsel"},2,2,2,2,3,2,"Kvalitet",{"$f":"B56*(VLOOKUP(C56,Konsekvens,2,FALSE))","v":10},{"$f":"D56*(VLOOKUP(E56,Konsekvens,2,FALSE))","v":10},{"$f":"F56*(VLOOKUP(G56,Konsekvens,2,FALSE))","v":15},"x",null,{"$f":"IF(A56=0,0,1)","v":1}]
[null,null,2,null,2,null,2,"Leverans",{"$f":"B56*(VLOOKUP(C57,Konsekvens,2,FALSE))","v":10},{"$f":"D56*(VLOOKUP(E57,Konsekvens,2,FALSE))","v":10},{"$f":"F56*(VLOOKUP(G57,Konsekvens,2,FALSE))","v":15},"x",null,{"$f":"N56","v":1}]
[{"$f":"'4. Oönskade händelser'!A36","v":"Förorening pga bräddning av uppströms liggande avloppsreningsverk"},1,2,2,2,2,2,"Kvalitet",{"$f":"B58*(VLOOKUP(C58,Konsekvens,2,FALSE))","v":5},{"$f":"D58*(VLOOKUP(E58,Konsekvens,2,FALSE))","v":10},{"$f":"F58*(VLOOKUP(G58,Konsekvens,2,FALSE))","v":10},"",null,{"$f":"IF(A58=0,0,1)","v":1}]
[null,null,1,null,1,null,1,"Leverans",{"$f":"B58*(VLOOKUP(C59,Konsekvens,2,FALSE))","v":1},{"$f":"D58*(VLOOKUP(E59,Konsekvens,2,FALSE))","v":2},{"$f":"F58*(VLOOKUP(G59,Konsekvens,2,FALSE))","v":2},"",null,{"$f":"N58","v":1}]
[{"$f":"'4. Oönskade händelser'!A37","v":"Översvämning av jordbruksmark som leder till att vattentäkten påverkas. Huvudsakliga risker bedöms vara påverkan av mikrbiologiska föroreningar samt ökade halter näringsämnen. "},2,2,2,2,3,2,"Kvalitet",{"$f":"B60*(VLOOKUP(C60,Konsekvens,2,FALSE))","v":10},{"$f":"D60*(VLOOKUP(E60,Konsekvens,2,FALSE))","v":10},{"$f":"F60*(VLOOKUP(G60,Konsekvens,2,FALSE))","v":15},"x",null,{"$f":"IF(A60=0,0,1)","v":1}]
[null,null,2,null,2,null,2,"Leverans",{"$f":"B60*(VLOOKUP(C61,Konsekvens,2,FALSE))","v":10},{"$f":"D60*(VLOOKUP(E61,Konsekvens,2,FALSE))","v":10},{"$f":"F60*(VLOOKUP(G61,Konsekvens,2,FALSE))","v":15},"x",null,{"$f":"N60","v":1}]
[{"$f":"'4. Oönskade händelser'!A38","v":0},null,null,null,null,null,null,"Kvalitet",{"$f":"B62*(VLOOKUP(C62,Konsekvens,2,FALSE))","v":{"$error":"#N/A"}},{"$f":"D62*(VLOOKUP(E62,Konsekvens,2,FALSE))","v":{"$error":"#N/A"}},{"$f":"F62*(VLOOKUP(G62,Konsekvens,2,FALSE))","v":{"$error":"#N/A"}},"",null,{"$f":"IF(A62=0,0,1)","v":0}]
[null,null,null,null,null,null,null,"Leverans",{"$f":"B62*(VLOOKUP(C63,Konsekvens,2,FALSE))","v":{"$error":"#N/A"}},{"$f":"D62*(VLOOKUP(E63,Konsekvens,2,FALSE))","v":{"$error":"#N/A"}},{"$f":"F62*(VLOOKUP(G63,Konsekvens,2,FALSE))","v":{"$error":"#N/A"}},"",null,{"$f":"N62","v":0}]
[{"$f":"'4. Oönskade händelser'!A39","v":0},null,null,null,null,null,null,"Kvalitet",{"$f":"B64*(VLOOKUP(C64,Konsekvens,2,FALSE))","v":{"$error":"#N/A"}},{"$f":"D64*(VLOOKUP(E64,Konsekvens,2,FALSE))","v":{"$error":"#N/A"}},{"$f":"F64*(VLOOKUP(G64,Konsekvens,2,FALSE))","v":{"$error":"#N/A"}},"",null,{"$f":"IF(A64=0,0,1)","v":0}]
[null,null,null,null,null,null,null,"Leverans",{"$f":"B64*(VLOOKUP(C65,Konsekvens,2,FALSE))","v":{"$error":"#N/A"}},{"$f":"D64*(VLOOKUP(E65,Konsekvens,2,FALSE))","v":{"$error":"#N/A"}},{"$f":"F64*(VLOOKUP(G65,Konsekvens,2,FALSE))","v":{"$error":"#N/A"}},"",null,{"$f":"N64","v":0}]
[{"$f":"'4. Oönskade händelser'!A40","v":0},null,null,null,null,null,null,"Kvalitet",{"$f":"B66*(VLOOKUP(C66,Konsekvens,2,FALSE))","v":{"$error":"#N/A"}},{"$f":"D66*(VLOOKUP(E66,Konsekvens,2,FALSE))","v":{"$error":"#N/A"}},{"$f":"F66*(VLOOKUP(G66,Konsekvens,2,FALSE))","v":{"$error":"#N/A"}},"",null,{"$f":"IF(A66=0,0,1)","v":0}]
[null,null,null,null,null,null,null,"Leverans",{"$f":"B66*(VLOOKUP(C67,Konsekvens,2,FALSE))","v":{"$error":"#N/A"}},{"$f":"D66*(VLOOKUP(E67,Konsekvens,2,FALSE))","v":{"$error":"#N/A"}},{"$f":"F66*(VLOOKUP(G67,Konsekvens,2,FALSE))","v":{"$error":"#N/A"}},"",null,{"$f":"N66","v":0}]
[{"$f":"'4. Oönskade händelser'!A41","v":0},null,null,null,null,null,null,"Kvalitet",{"$f":"B68*(VLOOKUP(C68,Konsekvens,2,FALSE))","v":{"$error":"#N/A"}},{"$f":"D68*(VLOOKUP(E68,Konsekvens,2,FALSE))","v":{"$error":"#N/A"}},{"$f":"F68*(VLOOKUP(G68,Konsekvens,2,FALSE))","v":{"$error":"#N/A"}},"",null,{"$f":"IF(A68=0,0,1)","v":0}]
[null,null,null,null,null,null,null,"Leverans",{"$f":"B68*(VLOOKUP(C69,Konsekvens,2,FALSE))","v":{"$error":"#N/A"}},{"$f":"D68*(VLOOKUP(E69,Konsekvens,2,FALSE))","v":{"$error":"#N/A"}},{"$f":"F68*(VLOOKUP(G69,Konsekvens,2,FALSE))","v":{"$error":"#N/A"}},"",null,{"$f":"N68","v":0}]
[{"$f":"'4. Oönskade händelser'!A42","v":0},null,null,null,null,null,null,"Kvalitet",{"$f":"B70*(VLOOKUP(C70,Konsekvens,2,FALSE))","v":{"$error":"#N/A"}},{"$f":"D70*(VLOOKUP(E70,Konsekvens,2,FALSE))","v":{"$error":"#N/A"}},{"$f":"F70*(VLOOKUP(G70,Konsekvens,2,FALSE))","v":{"$error":"#N/A"}},"",null,{"$f":"IF(A70=0,0,1)","v":0}]
[null,null,null,null,null,null,null,"Leverans",{"$f":"B70*(VLOOKUP(C71,Konsekvens,2,FALSE))","v":{"$error":"#N/A"}},{"$f":"D70*(VLOOKUP(E71,Konsekvens,2,FALSE))","v":{"$error":"#N/A"}},{"$f":"F70*(VLOOKUP(G71,Konsekvens,2,FALSE))","v":{"$error":"#N/A"}},"",null,{"$f":"N70","v":0}]
[{"$f":"'4. Oönskade händelser'!A43","v":0},null,null,null,null,null,null,"Kvalitet",{"$f":"B72*(VLOOKUP(C72,Konsekvens,2,FALSE))","v":{"$error":"#N/A"}},{"$f":"D72*(VLOOKUP(E72,Konsekvens,2,FALSE))","v":{"$error":"#N/A"}},{"$f":"F72*(VLOOKUP(G72,Konsekvens,2,FALSE))","v":{"$error":"#N/A"}},"",null,{"$f":"IF(A72=0,0,1)","v":0}]
[null,null,null,null,null,null,null,"Leverans",{"$f":"B72*(VLOOKUP(C73,Konsekvens,2,FALSE))","v":{"$error":"#N/A"}},{"$f":"D72*(VLOOKUP(E73,Konsekvens,2,FALSE))","v":{"$error":"#N/A"}},{"$f":"F72*(VLOOKUP(G73,Konsekvens,2,FALSE))","v":{"$error":"#N/A"}},{"$f":"IFERROR(IF(I73>10,\"x\",IF(J73>10,\"x\",IF(K73>10,\"x\",\"\"))),\"\")","v":""},null,{"$f":"N72","v":0}]
[{"$f":"'4. Oönskade händelser'!A44","v":0},null,null,null,null,null,null,"Kvalitet",{"$f":"B74*(VLOOKUP(C74,Konsekvens,2,FALSE))","v":{"$error":"#N/A"}},{"$f":"D74*(VLOOKUP(E74,Konsekvens,2,FALSE))","v":{"$error":"#N/A"}},{"$f":"F74*(VLOOKUP(G74,Konsekvens,2,FALSE))","v":{"$error":"#N/A"}},"",null,{"$f":"IF(A74=0,0,1)","v":0}]
[null,null,null,null,null,null,null,"Leverans",{"$f":"B74*(VLOOKUP(C75,Konsekvens,2,FALSE))","v":{"$error":"#N/A"}},{"$f":"D74*(VLOOKUP(E75,Konsekvens,2,FALSE))","v":{"$error":"#N/A"}},{"$f":"F74*(VLOOKUP(G75,Konsekvens,2,FALSE))","v":{"$error":"#N/A"}},"",null,{"$f":"N74","v":0}]
[{"$f":"'4. Oönskade händelser'!A45","v":0},null,null,null,null,null,null,"Kvalitet",{"$f":"B76*(VLOOKUP(C76,Konsekvens,2,FALSE))","v":{"$error":"#N/A"}},{"$f":"D76*(VLOOKUP(E76,Konsekvens,2,FALSE))","v":{"$error":"#N/A"}},{"$f":"F76*(VLOOKUP(G76,Konsekvens,2,FALSE))","v":{"$error":"#N/A"}},"",null,{"$f":"IF(A76=0,0,1)","v":0}]
[null,null,null,null,null,null,null,"Leverans",{"$f":"B76*(VLOOKUP(C77,Konsekvens,2,FALSE))","v":{"$error":"#N/A"}},{"$f":"D76*(VLOOKUP(E77,Konsekvens,2,FALSE))","v":{"$error":"#N/A"}},{"$f":"F76*(VLOOKUP(G77,Konsekvens,2,FALSE))","v":{"$error":"#N/A"}},"",null,{"$f":"N76","v":0}]
[{"$f":"'4. Oönskade händelser'!A46","v":0},null,null,null,null,null,null,"Kvalitet",{"$f":"B78*(VLOOKUP(C78,Konsekvens,2,FALSE))","v":{"$error":"#N/A"}},{"$f":"D78*(VLOOKUP(E78,Konsekvens,2,FALSE))","v":{"$error":"#N/A"}},{"$f":"F78*(VLOOKUP(G78,Konsekvens,2,FALSE))","v":{"$error":"#N/A"}},"",null,{"$f":"IF(A78=0,0,1)","v":0}]
[null,null,null,null,null,null,null,"Leverans",{"$f":"B78*(VLOOKUP(C79,Konsekvens,2,FALSE))","v":{"$error":"#N/A"}},{"$f":"D78*(VLOOKUP(E79,Konsekvens,2,FALSE))","v":{"$error":"#N/A"}},{"$f":"F78*(VLOOKUP(G79,Konsekvens,2,FALSE))","v":{"$error":"#N/A"}},"",null,{"$f":"N78","v":0}]
[{"$f":"'4. Oönskade händelser'!A47","v":"Vattenbrist pga naturligt sjunkande nivåer"},2,1,2,1,3,1,"Kvalitet",{"$f":"B80*(VLOOKUP(C80,Konsekvens,2,FALSE))","v":2},{"$f":"D80*(VLOOKUP(E80,Konsekvens,2,FALSE))","v":2},{"$f":"F80*(VLOOKUP(G80,Konsekvens,2,FALSE))","v":3},"",null,{"$f":"IF(A80=0,0,1)","v":1}]
[null,null,4,null,4,null,4,"Leverans",{"$f":"B80*(VLOOKUP(C81,Konsekvens,2,FALSE))","v":32},{"$f":"D80*(VLOOKUP(E81,Konsekvens,2,FALSE))","v":32},{"$f":"F80*(VLOOKUP(G81,Konsekvens,2,FALSE))","v":48},"x",null,{"$f":"N80","v":1}]
[{"$f":"'4. Oönskade händelser'!A48","v":"Risk för påverkan på teknisk utrustning (pumpar) om brunnarna blir torra vid låga grundvattennivåer."},1,1,1,1,2,1,"Kvalitet",{"$f":"B82*(VLOOKUP(C82,Konsekvens,2,FALSE))","v":1},{"$f":"D82*(VLOOKUP(E82,Konsekvens,2,FALSE))","v":1},{"$f":"F82*(VLOOKUP(G82,Konsekvens,2,FALSE))","v":2},"",null,{"$f":"IF(A82=0,0,1)","v":1}]
[null,null,2,null,2,null,2,"Leverans",{"$f":"B82*(VLOOKUP(C83,Konsekvens,2,FALSE))","v":5},{"$f":"D82*(VLOOKUP(E83,Konsekvens,2,FALSE))","v":5},{"$f":"F82*(VLOOKUP(G83,Konsekvens,2,FALSE))","v":10},"",null,{"$f":"N82","v":1}]
[{"$f":"'4. Oönskade händelser'!A49","v":0},null,null,null,null,null,null,"Kvalitet",{"$f":"B84*(VLOOKUP(C84,Konsekvens,2,FALSE))","v":{"$error":"#N/A"}},{"$f":"D84*(VLOOKUP(E84,Konsekvens,2,FALSE))","v":{"$error":"#N/A"}},{"$f":"F84*(VLOOKUP(G84,Konsekvens,2,FALSE))","v":{"$error":"#N/A"}},"",null,{"$f":"IF(A84=0,0,1)","v":0}]
[null,null,null,null,null,null,null,"Leverans",{"$f":"B84*(VLOOKUP(C85,Konsekvens,2,FALSE))","v":{"$error":"#N/A"}},{"$f":"D84*(VLOOKUP(E85,Konsekvens,2,FALSE))","v":{"$error":"#N/A"}},{"$f":"F84*(VLOOKUP(G85,Konsekvens,2,FALSE))","v":{"$error":"#N/A"}},"",null,{"$f":"N84","v":0}]
[{"$f":"'4. Oönskade händelser'!A50","v":0},null,null,null,null,null,null,"Kvalitet",{"$f":"B86*(VLOOKUP(C86,Konsekvens,2,FALSE))","v":{"$error":"#N/A"}},{"$f":"D86*(VLOOKUP(E86,Konsekvens,2,FALSE))","v":{"$error":"#N/A"}},{"$f":"F86*(VLOOKUP(G86,Konsekvens,2,FALSE))","v":{"$error":"#N/A"}},"",null,{"$f":"IF(A86=0,0,1)","v":0}]
[null,null,null,null,null,null,null,"Leverans",{"$f":"B86*(VLOOKUP(C87,Konsekvens,2,FALSE))","v":{"$error":"#N/A"}},{"$f":"D86*(VLOOKUP(E87,Konsekvens,2,FALSE))","v":{"$error":"#N/A"}},{"$f":"F86*(VLOOKUP(G87,Konsekvens,2,FALSE))","v":{"$error":"#N/A"}},"",null,{"$f":"N86","v":0}]
[{"$f":"'4. Oönskade händelser'!A51","v":0},null,null,null,null,null,null,"Kvalitet",{"$f":"B88*(VLOOKUP(C88,Konsekvens,2,FALSE))","v":{"$error":"#N/A"}},{"$f":"D88*(VLOOKUP(E88,Konsekvens,2,FALSE))","v":{"$error":"#N/A"}},{"$f":"F88*(VLOOKUP(G88,Konsekvens,2,FALSE))","v":{"$error":"#N/A"}},"",null,{"$f":"IF(A88=0,0,1)","v":0}]
[null,null,null,null,null,null,null,"Leverans",{"$f":"B88*(VLOOKUP(C89,Konsekvens,2,FALSE))","v":{"$error":"#N/A"}},{"$f":"D88*(VLOOKUP(E89,Konsekvens,2,FALSE))","v":{"$error":"#N/A"}},{"$f":"F88*(VLOOKUP(G89,Konsekvens,2,FALSE))","v":{"$error":"#N/A"}},"",null,{"$f":"N88","v":0}]
[{"$f":"'4. Oönskade händelser'!A52","v":0},null,null,null,null,null,null,"Kvalitet",{"$f":"B90*(VLOOKUP(C90,Konsekvens,2,FALSE))","v":{"$error":"#N/A"}},{"$f":"D90*(VLOOKUP(E90,Konsekvens,2,FALSE))","v":{"$error":"#N/A"}},{"$f":"F90*(VLOOKUP(G90,Konsekvens,2,FALSE))","v":{"$error":"#N/A"}},"",null,{"$f":"IF(A90=0,0,1)","v":0}]
[null,null,null,null,null,null,null,"Leverans",{"$f":"B90*(VLOOKUP(C91,Konsekvens,2,FALSE))","v":{"$error":"#N/A"}},{"$f":"D90*(VLOOKUP(E91,Konsekvens,2,FALSE))","v":{"$error":"#N/A"}},{"$f":"F90*(VLOOKUP(G91,Konsekvens,2,FALSE))","v":{"$error":"#N/A"}},"",null,{"$f":"N90","v":0}]
[{"$f":"'4. Oönskade händelser'!A53","v":0},null,null,null,null,null,null,"Kvalitet",{"$f":"B92*(VLOOKUP(C92,Konsekvens,2,FALSE))","v":{"$error":"#N/A"}},{"$f":"D92*(VLOOKUP(E92,Konsekvens,2,FALSE))","v":{"$error":"#N/A"}},{"$f":"F92*(VLOOKUP(G92,Konsekvens,2,FALSE))","v":{"$error":"#N/A"}},"",null,{"$f":"IF(A92=0,0,1)","v":0}]
[null,null,null,null,null,null,null,"Leverans",{"$f":"B92*(VLOOKUP(C93,Konsekvens,2,FALSE))","v":{"$error":"#N/A"}},{"$f":"D92*(VLOOKUP(E93,Konsekvens,2,FALSE))","v":{"$error":"#N/A"}},{"$f":"F92*(VLOOKUP(G93,Konsekvens,2,FALSE))","v":{"$error":"#N/A"}},"",null,{"$f":"N92","v":0}]
[{"$f":"'4. Oönskade händelser'!A54","v":0},null,null,null,null,null,null,"Kvalitet",{"$f":"B94*(VLOOKUP(C94,Konsekvens,2,FALSE))","v":{"$error":"#N/A"}},{"$f":"D94*(VLOOKUP(E94,Konsekvens,2,FALSE))","v":{"$error":"#N/A"}},{"$f":"F94*(VLOOKUP(G94,Konsekvens,2,FALSE))","v":{"$error":"#N/A"}},"",null,{"$f":"IF(A94=0,0,1)","v":0}]
[null,null,null,null,null,null,null,"Leverans",{"$f":"B94*(VLOOKUP(C95,Konsekvens,2,FALSE))","v":{"$error":"#N/A"}},{"$f":"D94*(VLOOKUP(E95,Konsekvens,2,FALSE))","v":{"$error":"#N/A"}},{"$f":"F94*(VLOOKUP(G95,Konsekvens,2,FALSE))","v":{"$error":"#N/A"}},"",null,{"$f":"N94","v":0}]
[{"$f":"'4. Oönskade händelser'!A55","v":0},null,null,null,null,null,null,"Kvalitet",{"$f":"B96*(VLOOKUP(C96,Konsekvens,2,FALSE))","v":{"$error":"#N/A"}},{"$f":"D96*(VLOOKUP(E96,Konsekvens,2,FALSE))","v":{"$error":"#N/A"}},{"$f":"F96*(VLOOKUP(G96,Konsekvens,2,FALSE))","v":{"$error":"#N/A"}},"",null,{"$f":"IF(A96=0,0,1)","v":0}]
[null,null,null,null,null,null,null,"Leverans",{"$f":"B96*(VLOOKUP(C97,Konsekvens,2,FALSE))","v":{"$error":"#N/A"}},{"$f":"D96*(VLOOKUP(E97,Konsekvens,2,FALSE))","v":{"$error":"#N/A"}},{"$f":"F96*(VLOOKUP(G97,Konsekvens,2,FALSE))","v":{"$error":"#N/A"}},"",null,{"$f":"N96","v":0}]
[{"$f":"'4. Oönskade händelser'!A56","v":0},null,null,null,null,null,null,"Kvalitet",{"$f":"B98*(VLOOKUP(C98,Konsekvens,2,FALSE))","v":{"$error":"#N/A"}},{"$f":"D98*(VLOOKUP(E98,Konsekvens,2,FALSE))","v":{"$error":"#N/A"}},{"$f":"F98*(VLOOKUP(G98,Konsekvens,2,FALSE))","v":{"$error":"#N/A"}},"",null,{"$f":"IF(A98=0,0,1)","v":0}]
[null,null,null,null,null,null,null,"Leverans",{"$f":"B98*(VLOOKUP(C99,Konsekvens,2,FALSE))","v":{"$error":"#N/A"}},{"$f":"D98*(VLOOKUP(E99,Konsekvens,2,FALSE))","v":{"$error":"#N/A"}},{"$f":"F98*(VLOOKUP(G99,Konsekvens,2,FALSE))","v":{"$error":"#N/A"}},"",null,{"$f":"N98","v":0}]
[{"$f":"'4. Oönskade händelser'!A57","v":0},null,null,null,null,null,null,"Kvalitet",{"$f":"B100*(VLOOKUP(C100,Konsekvens,2,FALSE))","v":{"$error":"#N/A"}},{"$f":"D100*(VLOOKUP(E100,Konsekvens,2,FALSE))","v":{"$error":"#N/A"}},{"$f":"F100*(VLOOKUP(G100,Konsekvens,2,FALSE))","v":{"$error":"#N/A"}},"",null,{"$f":"IF(A100=0,0,1)","v":0}]
[null,null,null,null,null,null,null,"Leverans",{"$f":"B100*(VLOOKUP(C101,Konsekvens,2,FALSE))","v":{"$error":"#N/A"}},{"$f":"D100*(VLOOKUP(E101,Konsekvens,2,FALSE))","v":{"$error":"#N/A"}},{"$f":"F100*(VLOOKUP(G101,Konsekvens,2,FALSE))","v":{"$error":"#N/A"}},"",null,{"$f":"N100","v":0}]
[{"$f":"'4. Oönskade händelser'!A58","v":"Försämrad vattenkvalitet som leder till att nuvarande reningsprocess blir otillräcklig."},1,2,1,2,2,2,"Kvalitet",{"$f":"B102*(VLOOKUP(C102,Konsekvens,2,FALSE))","v":5},{"$f":"D102*(VLOOKUP(E102,Konsekvens,2,FALSE))","v":5},{"$f":"F102*(VLOOKUP(G102,Konsekvens,2,FALSE))","v":10},"",null,{"$f":"IF(A102=0,0,1)","v":1}]
[null,null,1,null,1,null,1,"Leverans",{"$f":"B102*(VLOOKUP(C103,Konsekvens,2,FALSE))","v":1},{"$f":"D102*(VLOOKUP(E103,Konsekvens,2,FALSE))","v":1},{"$f":"F102*(VLOOKUP(G103,Konsekvens,2,FALSE))","v":2},"",null,{"$f":"N102","v":1}]
[{"$f":"'4. Oönskade händelser'!A59","v":0},null,null,null,null,null,null,"Kvalitet",{"$f":"B104*(VLOOKUP(C104,Konsekvens,2,FALSE))","v":{"$error":"#N/A"}},{"$f":"D104*(VLOOKUP(E104,Konsekvens,2,FALSE))","v":{"$error":"#N/A"}},{"$f":"F104*(VLOOKUP(G104,Konsekvens,2,FALSE))","v":{"$error":"#N/A"}},"",null,{"$f":"IF(A104=0,0,1)","v":0}]
[null,null,null,null,null,null,null,"Leverans",{"$f":"B104*(VLOOKUP(C105,Konsekvens,2,FALSE))","v":{"$error":"#N/A"}},{"$f":"D104*(VLOOKUP(E105,Konsekvens,2,FALSE))","v":{"$error":"#N/A"}},{"$f":"F104*(VLOOKUP(G105,Konsekvens,2,FALSE))","v":{"$error":"#N/A"}},"",null,{"$f":"N104","v":0}]
[{"$f":"'4. Oönskade händelser'!A60","v":0},null,null,null,null,null,null,"Kvalitet",{"$f":"B106*(VLOOKUP(C106,Konsekvens,2,FALSE))","v":{"$error":"#N/A"}},{"$f":"D106*(VLOOKUP(E106,Konsekvens,2,FALSE))","v":{"$error":"#N/A"}},{"$f":"F106*(VLOOKUP(G106,Konsekvens,2,FALSE))","v":{"$error":"#N/A"}},"",null,{"$f":"IF(A106=0,0,1)","v":0}]
[null,null,null,null,null,null,null,"Leverans",{"$f":"B106*(VLOOKUP(C107,Konsekvens,2,FALSE))","v":{"$error":"#N/A"}},{"$f":"D106*(VLOOKUP(E107,Konsekvens,2,FALSE))","v":{"$error":"#N/A"}},{"$f":"F106*(VLOOKUP(G107,Konsekvens,2,FALSE))","v":{"$error":"#N/A"}},"",null,{"$f":"N106","v":0}]
[{"$f":"'4. Oönskade händelser'!A61","v":0},null,null,null,null,null,null,"Kvalitet",{"$f":"B108*(VLOOKUP(C108,Konsekvens,2,FALSE))","v":{"$error":"#N/A"}},{"$f":"D108*(VLOOKUP(E108,Konsekvens,2,FALSE))","v":{"$error":"#N/A"}},{"$f":"F108*(VLOOKUP(G108,Konsekvens,2,FALSE))","v":{"$error":"#N/A"}},"",null,{"$f":"IF(A108=0,0,1)","v":0}]
[null,null,null,null,null,null,null,"Leverans",{"$f":"B108*(VLOOKUP(C109,Konsekvens,2,FALSE))","v":{"$error":"#N/A"}},{"$f":"D108*(VLOOKUP(E109,Konsekvens,2,FALSE))","v":{"$error":"#N/A"}},{"$f":"F108*(VLOOKUP(G109,Konsekvens,2,FALSE))","v":{"$error":"#N/A"}},"",null,{"$f":"N108","v":0}]
[{"$f":"'4. Oönskade händelser'!A62","v":0},null,null,null,null,null,null,"Kvalitet",{"$f":"B110*(VLOOKUP(C110,Konsekvens,2,FALSE))","v":{"$error":"#N/A"}},{"$f":"D110*(VLOOKUP(E110,Konsekvens,2,FALSE))","v":{"$error":"#N/A"}},{"$f":"F110*(VLOOKUP(G110,Konsekvens,2,FALSE))","v":{"$error":"#N/A"}},"",null,{"$f":"IF(A110=0,0,1)","v":0}]
[null,null,null,null,null,null,null,"Leverans",{"$f":"B110*(VLOOKUP(C111,Konsekvens,2,FALSE))","v":{"$error":"#N/A"}},{"$f":"D110*(VLOOKUP(E111,Konsekvens,2,FALSE))","v":{"$error":"#N/A"}},{"$f":"F110*(VLOOKUP(G111,Konsekvens,2,FALSE))","v":{"$error":"#N/A"}},"",null,{"$f":"N110","v":0}]
[{"$f":"'4. Oönskade händelser'!A63","v":0},null,null,null,null,null,null,"Kvalitet",{"$f":"B112*(VLOOKUP(C112,Konsekvens,2,FALSE))","v":{"$error":"#N/A"}},{"$f":"D112*(VLOOKUP(E112,Konsekvens,2,FALSE))","v":{"$error":"#N/A"}},{"$f":"F112*(VLOOKUP(G112,Konsekvens,2,FALSE))","v":{"$error":"#N/A"}},"",null,{"$f":"IF(A112=0,0,1)","v":0}]
[null,null,null,null,null,null,null,"Leverans",{"$f":"B112*(VLOOKUP(C113,Konsekvens,2,FALSE))","v":{"$error":"#N/A"}},{"$f":"D112*(VLOOKUP(E113,Konsekvens,2,FALSE))","v":{"$error":"#N/A"}},{"$f":"F112*(VLOOKUP(G113,Konsekvens,2,FALSE))","v":{"$error":"#N/A"}},"",null,{"$f":"N112","v":0}]
[{"$f":"'4. Oönskade händelser'!A64","v":0},null,null,null,null,null,null,"Kvalitet",{"$f":"B114*(VLOOKUP(C114,Konsekvens,2,FALSE))","v":{"$error":"#N/A"}},{"$f":"D114*(VLOOKUP(E114,Konsekvens,2,FALSE))","v":{"$error":"#N/A"}},{"$f":"F114*(VLOOKUP(G114,Konsekvens,2,FALSE))","v":{"$error":"#N/A"}},"",null,{"$f":"IF(A114=0,0,1)","v":0}]
[null,null,null,null,null,null,null,"Leverans",{"$f":"B114*(VLOOKUP(C115,Konsekvens,2,FALSE))","v":{"$error":"#N/A"}},{"$f":"D114*(VLOOKUP(E115,Konsekvens,2,FALSE))","v":{"$error":"#N/A"}},{"$f":"F114*(VLOOKUP(G115,Konsekvens,2,FALSE))","v":{"$error":"#N/A"}},"",null,{"$f":"N114","v":0}]
[{"$f":"'4. Oönskade händelser'!A65","v":0},null,null,null,null,null,null,"Kvalitet",{"$f":"B116*(VLOOKUP(C116,Konsekvens,2,FALSE))","v":{"$error":"#N/A"}},{"$f":"D116*(VLOOKUP(E116,Konsekvens,2,FALSE))","v":{"$error":"#N/A"}},{"$f":"F116*(VLOOKUP(G116,Konsekvens,2,FALSE))","v":{"$error":"#N/A"}},"",null,{"$f":"IF(A116=0,0,1)","v":0}]
[null,null,null,null,null,null,null,"Leverans",{"$f":"B116*(VLOOKUP(C117,Konsekvens,2,FALSE))","v":{"$error":"#N/A"}},{"$f":"D116*(VLOOKUP(E117,Konsekvens,2,FALSE))","v":{"$error":"#N/A"}},{"$f":"F116*(VLOOKUP(G117,Konsekvens,2,FALSE))","v":{"$error":"#N/A"}},"",null,{"$f":"N116","v":0}]
[{"$f":"'4. Oönskade händelser'!A66","v":0},null,null,null,null,null,null,"Kvalitet",{"$f":"B118*(VLOOKUP(C118,Konsekvens,2,FALSE))","v":{"$error":"#N/A"}},{"$f":"D118*(VLOOKUP(E118,Konsekvens,2,FALSE))","v":{"$error":"#N/A"}},{"$f":"F118*(VLOOKUP(G118,Konsekvens,2,FALSE))","v":{"$error":"#N/A"}},"",null,{"$f":"IF(A118=0,0,1)","v":0}]
[null,null,null,null,null,null,null,"Leverans",{"$f":"B118*(VLOOKUP(C119,Konsekvens,2,FALSE))","v":{"$error":"#N/A"}},{"$f":"D118*(VLOOKUP(E119,Konsekvens,2,FALSE))","v":{"$error":"#N/A"}},{"$f":"F118*(VLOOKUP(G119,Konsekvens,2,FALSE))","v":{"$error":"#N/A"}},"",null,{"$f":"N118","v":0}]
[{"$f":"'4. Oönskade händelser'!A67","v":0},null,null,null,null,null,null,"Kvalitet",{"$f":"B120*(VLOOKUP(C120,Konsekvens,2,FALSE))","v":{"$error":"#N/A"}},{"$f":"D120*(VLOOKUP(E120,Konsekvens,2,FALSE))","v":{"$error":"#N/A"}},{"$f":"F120*(VLOOKUP(G120,Konsekvens,2,FALSE))","v":{"$error":"#N/A"}},"",null,{"$f":"IF(A120=0,0,1)","v":0}]
[null,null,null,null,null,null,null,"Leverans",{"$f":"B120*(VLOOKUP(C121,Konsekvens,2,FALSE))","v":{"$error":"#N/A"}},{"$f":"D120*(VLOOKUP(E121,Konsekvens,2,FALSE))","v":{"$error":"#N/A"}},{"$f":"F120*(VLOOKUP(G121,Konsekvens,2,FALSE))","v":{"$error":"#N/A"}},"",null,{"$f":"N120","v":0}]
[{"$f":"'4. Oönskade händelser'!A68","v":0},null,null,null,null,null,null,"Kvalitet",{"$f":"B122*(VLOOKUP(C122,Konsekvens,2,FALSE))","v":{"$error":"#N/A"}},{"$f":"D122*(VLOOKUP(E122,Konsekvens,2,FALSE))","v":{"$error":"#N/A"}},{"$f":"F122*(VLOOKUP(G122,Konsekvens,2,FALSE))","v":{"$error":"#N/A"}},"",null,{"$f":"IF(A122=0,0,1)","v":0}]
[null,null,null,null,null,null,null,"Leverans",{"$f":"B122*(VLOOKUP(C123,Konsekvens,2,FALSE))","v":{"$error":"#N/A"}},{"$f":"D122*(VLOOKUP(E123,Konsekvens,2,FALSE))","v":{"$error":"#N/A"}},{"$f":"F122*(VLOOKUP(G123,Konsekvens,2,FALSE))","v":{"$error":"#N/A"}},"",null,{"$f":"N122","v":0}]
[{"$f":"'4. Oönskade händelser'!A69","v":0},null,null,null,null,null,null,"Kvalitet",{"$f":"B124*(VLOOKUP(C124,Konsekvens,2,FALSE))","v":{"$error":"#N/A"}},{"$f":"D124*(VLOOKUP(E124,Konsekvens,2,FALSE))","v":{"$error":"#N/A"}},{"$f":"F124*(VLOOKUP(G124,Konsekvens,2,FALSE))","v":{"$error":"#N/A"}},"",null,{"$f":"IF(A124=0,0,1)","v":0}]
[null,null,null,null,null,null,null,"Leverans",{"$f":"B124*(VLOOKUP(C125,Konsekvens,2,FALSE))","v":{"$error":"#N/A"}},{"$f":"D124*(VLOOKUP(E125,Konsekvens,2,FALSE))","v":{"$error":"#N/A"}},{"$f":"F124*(VLOOKUP(G125,Konsekvens,2,FALSE))","v":{"$error":"#N/A"}},"",null,{"$f":"N124","v":0}]
[{"$f":"'4. Oönskade händelser'!A70","v":0},null,null,null,null,null,null,"Kvalitet",{"$f":"B126*(VLOOKUP(C126,Konsekvens,2,FALSE))","v":{"$error":"#N/A"}},{"$f":"D126*(VLOOKUP(E126,Konsekvens,2,FALSE))","v":{"$error":"#N/A"}},{"$f":"F126*(VLOOKUP(G126,Konsekvens,2,FALSE))","v":{"$error":"#N/A"}},"",null,{"$f":"IF(A126=0,0,1)","v":0}]
[null,null,null,null,null,null,null,"Leverans",{"$f":"B126*(VLOOKUP(C127,Konsekvens,2,FALSE))","v":{"$error":"#N/A"}},{"$f":"D126*(VLOOKUP(E127,Konsekvens,2,FALSE))","v":{"$error":"#N/A"}},{"$f":"F126*(VLOOKUP(G127,Konsekvens,2,FALSE))","v":{"$error":"#N/A"}},"",null,{"$f":"N126","v":0}]
[{"$f":"'4. Oönskade händelser'!A71","v":"Översvämning av tryckstegringsstationerna 56 och 32 som leder till fysisk påverkan på anläggningarna.  "},1,1,1,1,1,1,"Kvalitet",{"$f":"B128*(VLOOKUP(C128,Konsekvens,2,FALSE))","v":1},{"$f":"D128*(VLOOKUP(E128,Konsekvens,2,FALSE))","v":1},{"$f":"F128*(VLOOKUP(G128,Konsekvens,2,FALSE))","v":1},"",null,{"$f":"IF(A128=0,0,1)","v":1}]
[null,null,2,null,2,null,2,"Leverans",{"$f":"B128*(VLOOKUP(C129,Konsekvens,2,FALSE))","v":5},{"$f":"D128*(VLOOKUP(E129,Konsekvens,2,FALSE))","v":5},{"$f":"F128*(VLOOKUP(G129,Konsekvens,2,FALSE))","v":5},"",null,{"$f":"N128","v":1}]
[{"$f":"'4. Oönskade händelser'!A72","v":0},null,null,null,null,null,null,"Kvalitet",{"$f":"B130*(VLOOKUP(C130,Konsekvens,2,FALSE))","v":{"$error":"#N/A"}},{"$f":"D130*(VLOOKUP(E130,Konsekvens,2,FALSE))","v":{"$error":"#N/A"}},{"$f":"F130*(VLOOKUP(G130,Konsekvens,2,FALSE))","v":{"$error":"#N/A"}},"",null,{"$f":"IF(A130=0,0,1)","v":0}]
[null,null,null,null,null,null,null,"Leverans",{"$f":"B130*(VLOOKUP(C131,Konsekvens,2,FALSE))","v":{"$error":"#N/A"}},{"$f":"D130*(VLOOKUP(E131,Konsekvens,2,FALSE))","v":{"$error":"#N/A"}},{"$f":"F130*(VLOOKUP(G131,Konsekvens,2,FALSE))","v":{"$error":"#N/A"}},"",null,{"$f":"N130","v":0}]
[{"$f":"'4. Oönskade händelser'!A73","v":0},null,null,null,null,null,null,"Kvalitet",{"$f":"B132*(VLOOKUP(C132,Konsekvens,2,FALSE))","v":{"$error":"#N/A"}},{"$f":"D132*(VLOOKUP(E132,Konsekvens,2,FALSE))","v":{"$error":"#N/A"}},{"$f":"F132*(VLOOKUP(G132,Konsekvens,2,FALSE))","v":{"$error":"#N/A"}},"",null,{"$f":"IF(A132=0,0,1)","v":0}]
[null,null,null,null,null,null,null,"Leverans",{"$f":"B132*(VLOOKUP(C133,Konsekvens,2,FALSE))","v":{"$error":"#N/A"}},{"$f":"D132*(VLOOKUP(E133,Konsekvens,2,FALSE))","v":{"$error":"#N/A"}},{"$f":"F132*(VLOOKUP(G133,Konsekvens,2,FALSE))","v":{"$error":"#N/A"}},"",null,{"$f":"N132","v":0}]
[{"$f":"'4. Oönskade händelser'!A74","v":0},null,null,null,null,null,null,"Kvalitet",{"$f":"B134*(VLOOKUP(C134,Konsekvens,2,FALSE))","v":{"$error":"#N/A"}},{"$f":"D134*(VLOOKUP(E134,Konsekvens,2,FALSE))","v":{"$error":"#N/A"}},{"$f":"F134*(VLOOKUP(G134,Konsekvens,2,FALSE))","v":{"$error":"#N/A"}},"",null,{"$f":"IF(A134=0,0,1)","v":0}]
[null,null,null,null,null,null,null,"Leverans",{"$f":"B134*(VLOOKUP(C135,Konsekvens,2,FALSE))","v":{"$error":"#N/A"}},{"$f":"D134*(VLOOKUP(E135,Konsekvens,2,FALSE))","v":{"$error":"#N/A"}},{"$f":"F134*(VLOOKUP(G135,Konsekvens,2,FALSE))","v":{"$error":"#N/A"}},"",null,{"$f":"N134","v":0}]
[{"$f":"'4. Oönskade händelser'!A75","v":0},null,null,null,null,null,null,"Kvalitet",{"$f":"B136*(VLOOKUP(C136,Konsekvens,2,FALSE))","v":{"$error":"#N/A"}},{"$f":"D136*(VLOOKUP(E136,Konsekvens,2,FALSE))","v":{"$error":"#N/A"}},{"$f":"F136*(VLOOKUP(G136,Konsekvens,2,FALSE))","v":{"$error":"#N/A"}},"",null,{"$f":"IF(A136=0,0,1)","v":0}]
[null,null,null,null,null,null,null,"Leverans",{"$f":"B136*(VLOOKUP(C137,Konsekvens,2,FALSE))","v":{"$error":"#N/A"}},{"$f":"D136*(VLOOKUP(E137,Konsekvens,2,FALSE))","v":{"$error":"#N/A"}},{"$f":"F136*(VLOOKUP(G137,Konsekvens,2,FALSE))","v":{"$error":"#N/A"}},{"$f":"IFERROR(IF(I137>10,\"x\",IF(J137>10,\"x\",IF(K137>10,\"x\",\"\"))),\"\")","v":""},null,{"$f":"N136","v":0}]
[{"$f":"'4. Oönskade händelser'!A76","v":0},null,null,null,null,null,null,"Kvalitet",{"$f":"B138*(VLOOKUP(C138,Konsekvens,2,FALSE))","v":{"$error":"#N/A"}},{"$f":"D138*(VLOOKUP(E138,Konsekvens,2,FALSE))","v":{"$error":"#N/A"}},{"$f":"F138*(VLOOKUP(G138,Konsekvens,2,FALSE))","v":{"$error":"#N/A"}},"",null,{"$f":"IF(A138=0,0,1)","v":0}]
[null,null,null,null,null,null,null,"Leverans",{"$f":"B138*(VLOOKUP(C139,Konsekvens,2,FALSE))","v":{"$error":"#N/A"}},{"$f":"D138*(VLOOKUP(E139,Konsekvens,2,FALSE))","v":{"$error":"#N/A"}},{"$f":"F138*(VLOOKUP(G139,Konsekvens,2,FALSE))","v":{"$error":"#N/A"}},"",null,{"$f":"N138","v":0}]
[{"$f":"'4. Oönskade händelser'!A77","v":0},null,null,null,null,null,null,"Kvalitet",{"$f":"B140*(VLOOKUP(C140,Konsekvens,2,FALSE))","v":{"$error":"#N/A"}},{"$f":"D140*(VLOOKUP(E140,Konsekvens,2,FALSE))","v":{"$error":"#N/A"}},{"$f":"F140*(VLOOKUP(G140,Konsekvens,2,FALSE))","v":{"$error":"#N/A"}},"",null,{"$f":"IF(A140=0,0,1)","v":0}]
[null,null,null,null,null,null,null,"Leverans",{"$f":"B140*(VLOOKUP(C141,Konsekvens,2,FALSE))","v":{"$error":"#N/A"}},{"$f":"D140*(VLOOKUP(E141,Konsekvens,2,FALSE))","v":{"$error":"#N/A"}},{"$f":"F140*(VLOOKUP(G141,Konsekvens,2,FALSE))","v":{"$error":"#N/A"}},"",null,{"$f":"N140","v":0}]
[{"$f":"'4. Oönskade händelser'!A78","v":0},null,null,null,null,null,null,"Kvalitet",{"$f":"B142*(VLOOKUP(C142,Konsekvens,2,FALSE))","v":{"$error":"#N/A"}},{"$f":"D142*(VLOOKUP(E142,Konsekvens,2,FALSE))","v":{"$error":"#N/A"}},{"$f":"F142*(VLOOKUP(G142,Konsekvens,2,FALSE))","v":{"$error":"#N/A"}},"",null,{"$f":"IF(A142=0,0,1)","v":0}]
[null,null,null,null,null,null,null,"Leverans",{"$f":"B142*(VLOOKUP(C143,Konsekvens,2,FALSE))","v":{"$error":"#N/A"}},{"$f":"D142*(VLOOKUP(E143,Konsekvens,2,FALSE))","v":{"$error":"#N/A"}},{"$f":"F142*(VLOOKUP(G143,Konsekvens,2,FALSE))","v":{"$error":"#N/A"}},"",null,{"$f":"N142","v":0}]
[{"$f":"'4. Oönskade händelser'!A79","v":0},null,null,null,null,null,null,"Kvalitet",{"$f":"B144*(VLOOKUP(C144,Konsekvens,2,FALSE))","v":{"$error":"#N/A"}},{"$f":"D144*(VLOOKUP(E144,Konsekvens,2,FALSE))","v":{"$error":"#N/A"}},{"$f":"F144*(VLOOKUP(G144,Konsekvens,2,FALSE))","v":{"$error":"#N/A"}},"",null,{"$f":"IF(A144=0,0,1)","v":0}]
[null,null,null,null,null,null,null,"Leverans",{"$f":"B144*(VLOOKUP(C145,Konsekvens,2,FALSE))","v":{"$error":"#N/A"}},{"$f":"D144*(VLOOKUP(E145,Konsekvens,2,FALSE))","v":{"$error":"#N/A"}},{"$f":"F144*(VLOOKUP(G145,Konsekvens,2,FALSE))","v":{"$error":"#N/A"}},"",null,{"$f":"N144","v":0}]
[{"$f":"'4. Oönskade händelser'!A80","v":0},null,null,null,null,null,null,"Kvalitet",{"$f":"B146*(VLOOKUP(C146,Konsekvens,2,FALSE))","v":{"$error":"#N/A"}},{"$f":"D146*(VLOOKUP(E146,Konsekvens,2,FALSE))","v":{"$error":"#N/A"}},{"$f":"F146*(VLOOKUP(G146,Konsekvens,2,FALSE))","v":{"$error":"#N/A"}},"",null,{"$f":"IF(A146=0,0,1)","v":0}]
[null,null,null,null,null,null,null,"Leverans",{"$f":"B146*(VLOOKUP(C147,Konsekvens,2,FALSE))","v":{"$error":"#N/A"}},{"$f":"D146*(VLOOKUP(E147,Konsekvens,2,FALSE))","v":{"$error":"#N/A"}},{"$f":"F146*(VLOOKUP(G147,Konsekvens,2,FALSE))","v":{"$error":"#N/A"}},"",null,{"$f":"N146","v":0}]
[{"$f":"'4. Oönskade händelser'!A81","v":0},null,null,null,null,null,null,"Kvalitet",{"$f":"B148*(VLOOKUP(C148,Konsekvens,2,FALSE))","v":{"$error":"#N/A"}},{"$f":"D148*(VLOOKUP(E148,Konsekvens,2,FALSE))","v":{"$error":"#N/A"}},{"$f":"F148*(VLOOKUP(G148,Konsekvens,2,FALSE))","v":{"$error":"#N/A"}},"",null,{"$f":"IF(A148=0,0,1)","v":0}]
[null,null,null,null,null,null,null,"Leverans",{"$f":"B148*(VLOOKUP(C149,Konsekvens,2,FALSE))","v":{"$error":"#N/A"}},{"$f":"D148*(VLOOKUP(E149,Konsekvens,2,FALSE))","v":{"$error":"#N/A"}},{"$f":"F148*(VLOOKUP(G149,Konsekvens,2,FALSE))","v":{"$error":"#N/A"}},"",null,{"$f":"N148","v":0}]
[{"$f":"'4. Oönskade händelser'!A82","v":0},null,null,null,null,null,null,"Kvalitet",{"$f":"B150*(VLOOKUP(C150,Konsekvens,2,FALSE))","v":{"$error":"#N/A"}},{"$f":"D150*(VLOOKUP(E150,Konsekvens,2,FALSE))","v":{"$error":"#N/A"}},{"$f":"F150*(VLOOKUP(G150,Konsekvens,2,FALSE))","v":{"$error":"#N/A"}},"",null,{"$f":"IF(A150=0,0,1)","v":0}]
[null,null,null,null,null,null,null,"Leverans",{"$f":"B150*(VLOOKUP(C151,Konsekvens,2,FALSE))","v":{"$error":"#N/A"}},{"$f":"D150*(VLOOKUP(E151,Konsekvens,2,FALSE))","v":{"$error":"#N/A"}},{"$f":"F150*(VLOOKUP(G151,Konsekvens,2,FALSE))","v":{"$error":"#N/A"}},"",null,{"$f":"N150","v":0}]
[{"$f":"'4. Oönskade händelser'!A83","v":0},null,null,null,null,null,null,"Kvalitet",{"$f":"B152*(VLOOKUP(C152,Konsekvens,2,FALSE))","v":{"$error":"#N/A"}},{"$f":"D152*(VLOOKUP(E152,Konsekvens,2,FALSE))","v":{"$error":"#N/A"}},{"$f":"F152*(VLOOKUP(G152,Konsekvens,2,FALSE))","v":{"$error":"#N/A"}},"",null,{"$f":"IF(A152=0,0,1)","v":0}]
[null,null,null,null,null,null,null,"Leverans",{"$f":"B152*(VLOOKUP(C153,Konsekvens,2,FALSE))","v":{"$error":"#N/A"}},{"$f":"D152*(VLOOKUP(E153,Konsekvens,2,FALSE))","v":{"$error":"#N/A"}},{"$f":"F152*(VLOOKUP(G153,Konsekvens,2,FALSE))","v":{"$error":"#N/A"}},"",null,{"$f":"N152","v":0}]
[{"$f":"'4. Oönskade händelser'!A84","v":0},null,null,null,null,null,null,"Kvalitet",{"$f":"B154*(VLOOKUP(C154,Konsekvens,2,FALSE))","v":{"$error":"#N/A"}},{"$f":"D154*(VLOOKUP(E154,Konsekvens,2,FALSE))","v":{"$error":"#N/A"}},{"$f":"F154*(VLOOKUP(G154,Konsekvens,2,FALSE))","v":{"$error":"#N/A"}},"",null,{"$f":"IF(A154=0,0,1)","v":0}]
[null,null,null,null,null,null,null,"Leverans",{"$f":"B154*(VLOOKUP(C155,Konsekvens,2,FALSE))","v":{"$error":"#N/A"}},{"$f":"D154*(VLOOKUP(E155,Konsekvens,2,FALSE))","v":{"$error":"#N/A"}},{"$f":"F154*(VLOOKUP(G155,Konsekvens,2,FALSE))","v":{"$error":"#N/A"}},"",null,{"$f":"N154","v":0}]
["Oönskade händelser Klimatanalys"]
[{"$f":"'4. Oönskade händelser'!A86","v":0},null,null,null,null,null,null,"Kvalitet",{"$f":"B157*(VLOOKUP(C157,Konsekvens,2,FALSE))","v":{"$error":"#N/A"}},{"$f":"D157*(VLOOKUP(E157,Konsekvens,2,FALSE))","v":{"$error":"#N/A"}},{"$f":"F157*(VLOOKUP(G157,Konsekvens,2,FALSE))","v":{"$error":"#N/A"}},"",null,{"$f":"IF(A157=0,0,1)","v":0}]
[null,null,null,null,null,null,null,"Leverans",{"$f":"B157*(VLOOKUP(C158,Konsekvens,2,FALSE))","v":{"$error":"#N/A"}},{"$f":"D157*(VLOOKUP(E158,Konsekvens,2,FALSE))","v":{"$error":"#N/A"}},{"$f":"F157*(VLOOKUP(G158,Konsekvens,2,FALSE))","v":{"$error":"#N/A"}},"",null,{"$f":"N157","v":0}]
[{"$f":"'4. Oönskade händelser'!A87","v":"Ökad risk för låga grundvattennivåer i samband med låga perioder med värmebölja"},1,1,1,1,2,1,"Kvalitet",{"$f":"B159*(VLOOKUP(C159,Konsekvens,2,FALSE))","v":1},{"$f":"D159*(VLOOKUP(E159,Konsekvens,2,FALSE))","v":1},{"$f":"F159*(VLOOKUP(G159,Konsekvens,2,FALSE))","v":2},"",null,{"$f":"IF(A159=0,0,1)","v":1}]
[null,null,2,null,2,null,2,"Leverans",{"$f":"B159*(VLOOKUP(C160,Konsekvens,2,FALSE))","v":5},{"$f":"D159*(VLOOKUP(E160,Konsekvens,2,FALSE))","v":5},{"$f":"F159*(VLOOKUP(G160,Konsekvens,2,FALSE))","v":10},"",null,{"$f":"N159","v":1}]
[{"$f":"'4. Oönskade händelser'!A88","v":"Bräddning av pumpstationer som leder till påverkan på vattenkvalitet. "},1,3,1,3,2,3,"Kvalitet",{"$f":"B161*(VLOOKUP(C161,Konsekvens,2,FALSE))","v":10},{"$f":"D161*(VLOOKUP(E161,Konsekvens,2,FALSE))","v":10},{"$f":"F161*(VLOOKUP(G161,Konsekvens,2,FALSE))","v":20},"x",null,{"$f":"IF(A161=0,0,1)","v":1}]
[null,null,1,null,1,null,1,"Leverans",{"$f":"B161*(VLOOKUP(C162,Konsekvens,2,FALSE))","v":1},{"$f":"D161*(VLOOKUP(E162,Konsekvens,2,FALSE))","v":1},{"$f":"F161*(VLOOKUP(G162,Konsekvens,2,FALSE))","v":2},"",null,{"$f":"N161","v":1}]
[{"$f":"'4. Oönskade händelser'!A89","v":"Avloppspåverkan från grannkommunens avloppsreningsverk på ytvattnet som påverkar grundvattenkvaliteten "},1,3,2,3,2,3,"Kvalitet",{"$f":"B163*(VLOOKUP(C163,Konsekvens,2,FALSE))","v":10},{"$f":"D163*(VLOOKUP(E163,Konsekvens,2,FALSE))","v":20},{"$f":"F163*(VLOOKUP(G163,Konsekvens,2,FALSE))","v":20},"x",null,{"$f":"IF(A163=0,0,1)","v":1}]
[null,null,1,null,1,null,1,"Leverans",{"$f":"B163*(VLOOKUP(C164,Konsekvens,2,FALSE))","v":1},{"$f":"D163*(VLOOKUP(E164,Konsekvens,2,FALSE))","v":2},{"$f":"F163*(VLOOKUP(G164,Konsekvens,2,FALSE))","v":2},"",null,{"$f":"N163","v":1}]
[{"$f":"'4. Oönskade händelser'!A90","v":0},null,null,null,null,null,null,"Kvalitet",{"$f":"B165*(VLOOKUP(C165,Konsekvens,2,FALSE))","v":{"$error":"#N/A"}},{"$f":"D165*(VLOOKUP(E165,Konsekvens,2,FALSE))","v":{"$error":"#N/A"}},{"$f":"F165*(VLOOKUP(G165,Konsekvens,2,FALSE))","v":{"$error":"#N/A"}},"",null,{"$f":"IF(A165=0,0,1)","v":0}]
[null,null,null,null,null,null,null,"Leverans",{"$f":"B165*(VLOOKUP(C166,Konsekvens,2,FALSE))","v":{"$error":"#N/A"}},{"$f":"D165*(VLOOKUP(E166,Konsekvens,2,FALSE))","v":{"$error":"#N/A"}},{"$f":"F165*(VLOOKUP(G166,Konsekvens,2,FALSE))","v":{"$error":"#N/A"}},"",null,{"$f":"N165","v":0}]
[{"$f":"'4. Oönskade händelser'!A91","v":0},null,null,null,null,null,null,"Kvalitet",{"$f":"B167*(VLOOKUP(C167,Konsekvens,2,FALSE))","v":{"$error":"#N/A"}},{"$f":"D167*(VLOOKUP(E167,Konsekvens,2,FALSE))","v":{"$error":"#N/A"}},{"$f":"F167*(VLOOKUP(G167,Konsekvens,2,FALSE))","v":{"$error":"#N/A"}},"",null,{"$f":"IF(A167=0,0,1)","v":0}]
[null,null,null,null,null,null,null,"Leverans",{"$f":"B167*(VLOOKUP(C168,Konsekvens,2,FALSE))","v":{"$error":"#N/A"}},{"$f":"D167*(VLOOKUP(E168,Konsekvens,2,FALSE))","v":{"$error":"#N/A"}},{"$f":"F167*(VLOOKUP(G168,Konsekvens,2,FALSE))","v":{"$error":"#N/A"}},"",null,{"$f":"N167","v":0}]
[{"$f":"'4. Oönskade händelser'!A92","v":"Ras och skred som leder till ledningsbrott"},1,1,2,1,2,1,"Kvalitet",{"$f":"B169*(VLOOKUP(C169,Konsekvens,2,FALSE))","v":1},{"$f":"D169*(VLOOKUP(E169,Konsekvens,2,FALSE))","v":2},{"$f":"F169*(VLOOKUP(G169,Konsekvens,2,FALSE))","v":2},"",null,{"$f":"IF(A169=0,0,1)","v":1}]
[null,null,4,null,4,null,4,"Leverans",{"$f":"B169*(VLOOKUP(C170,Konsekvens,2,FALSE))","v":16},{"$f":"D169*(VLOOKUP(E170,Konsekvens,2,FALSE))","v":32},{"$f":"F169*(VLOOKUP(G170,Konsekvens,2,FALSE))","v":32},"x",null,{"$f":"N169","v":1}]
[{"$f":"'4. Oönskade händelser'!A93","v":"Försämrad råvattenkvalitet orsakad av förändrad vattenkvalitet i ån med avseende på organiskt material. "},1,2,2,2,2,2,"Kvalitet",{"$f":"B171*(VLOOKUP(C171,Konsekvens,2,FALSE))","v":5},{"$f":"D171*(VLOOKUP(E171,Konsekvens,2,FALSE))","v":10},{"$f":"F171*(VLOOKUP(G171,Konsekvens,2,FALSE))","v":10},"",null,{"$f":"IF(A171=0,0,1)","v":1}]
[null,null,1,null,1,null,1,"Leverans",{"$f":"B171*(VLOOKUP(C172,Konsekvens,2,FALSE))","v":1},{"$f":"D171*(VLOOKUP(E172,Konsekvens,2,FALSE))","v":2},{"$f":"F171*(VLOOKUP(G172,Konsekvens,2,FALSE))","v":2},"",null,{"$f":"N171","v":1}]
[{"$f":"'4. Oönskade händelser'!A94","v":0},null,null,null,null,null,null,"Kvalitet",{"$f":"B173*(VLOOKUP(C173,Konsekvens,2,FALSE))","v":{"$error":"#N/A"}},{"$f":"D173*(VLOOKUP(E173,Konsekvens,2,FALSE))","v":{"$error":"#N/A"}},{"$f":"F173*(VLOOKUP(G173,Konsekvens,2,FALSE))","v":{"$error":"#N/A"}},"",null,{"$f":"IF(A173=0,0,1)","v":0}]
[null,null,null,null,null,null,null,"Leverans",{"$f":"B173*(VLOOKUP(C174,Konsekvens,2,FALSE))","v":{"$error":"#N/A"}},{"$f":"D173*(VLOOKUP(E174,Konsekvens,2,FALSE))","v":{"$error":"#N/A"}},{"$f":"F173*(VLOOKUP(G174,Konsekvens,2,FALSE))","v":{"$error":"#N/A"}},"",null,{"$f":"N173","v":0}]
[{"$f":"'4. Oönskade händelser'!A95","v":0},null,null,null,null,null,null,"Kvalitet",{"$f":"B175*(VLOOKUP(C175,Konsekvens,2,FALSE))","v":{"$error":"#N/A"}},{"$f":"D175*(VLOOKUP(E175,Konsekvens,2,FALSE))","v":{"$error":"#N/A"}},{"$f":"F175*(VLOOKUP(G175,Konsekvens,2,FALSE))","v":{"$error":"#N/A"}},"",null,{"$f":"IF(A175=0,0,1)","v":0}]
[null,null,null,null,null,null,null,"Leverans",{"$f":"B175*(VLOOKUP(C176,Konsekvens,2,FALSE))","v":{"$error":"#N/A"}},{"$f":"D175*(VLOOKUP(E176,Konsekvens,2,FALSE))","v":{"$error":"#N/A"}},{"$f":"F175*(VLOOKUP(G176,Konsekvens,2,FALSE))","v":{"$error":"#N/A"}},"",null,{"$f":"N175","v":0}]
[{"$f":"'4. Oönskade händelser'!A96","v":0},null,null,null,null,null,null,"Kvalitet",{"$f":"B177*(VLOOKUP(C177,Konsekvens,2,FALSE))","v":{"$error":"#N/A"}},{"$f":"D177*(VLOOKUP(E177,Konsekvens,2,FALSE))","v":{"$error":"#N/A"}},{"$f":"F177*(VLOOKUP(G177,Konsekvens,2,FALSE))","v":{"$error":"#N/A"}},"",null,{"$f":"IF(A177=0,0,1)","v":0}]
[null,null,null,null,null,null,null,"Leverans",{"$f":"B177*(VLOOKUP(C178,Konsekvens,2,FALSE))","v":{"$error":"#N/A"}},{"$f":"D177*(VLOOKUP(E178,Konsekvens,2,FALSE))","v":{"$error":"#N/A"}},{"$f":"F177*(VLOOKUP(G178,Konsekvens,2,FALSE))","v":{"$error":"#N/A"}},"",null,{"$f":"N177","v":0}]
[{"$f":"'4. Oönskade händelser'!A97","v":0},null,null,null,null,null,null,"Kvalitet",{"$f":"B179*(VLOOKUP(C179,Konsekvens,2,FALSE))","v":{"$error":"#N/A"}},{"$f":"D179*(VLOOKUP(E179,Konsekvens,2,FALSE))","v":{"$error":"#N/A"}},{"$f":"F179*(VLOOKUP(G179,Konsekvens,2,FALSE))","v":{"$error":"#N/A"}},"",null,{"$f":"IF(A179=0,0,1)","v":0}]
[null,null,null,null,null,null,null,"Leverans",{"$f":"B179*(VLOOKUP(C180,Konsekvens,2,FALSE))","v":{"$error":"#N/A"}},{"$f":"D179*(VLOOKUP(E180,Konsekvens,2,FALSE))","v":{"$error":"#N/A"}},{"$f":"F179*(VLOOKUP(G180,Konsekvens,2,FALSE))","v":{"$error":"#N/A"}},"",null,{"$f":"N179","v":0}]
[{"$f":"'4. Oönskade händelser'!A98","v":0},null,null,null,null,null,null,"Kvalitet",{"$f":"B181*(VLOOKUP(C181,Konsekvens,2,FALSE))","v":{"$error":"#N/A"}},{"$f":"D181*(VLOOKUP(E181,Konsekvens,2,FALSE))","v":{"$error":"#N/A"}},{"$f":"F181*(VLOOKUP(G181,Konsekvens,2,FALSE))","v":{"$error":"#N/A"}},"",null,{"$f":"IF(A181=0,0,1)","v":0}]
[null,null,null,null,null,null,null,"Leverans",{"$f":"B181*(VLOOKUP(C182,Konsekvens,2,FALSE))","v":{"$error":"#N/A"}},{"$f":"D181*(VLOOKUP(E182,Konsekvens,2,FALSE))","v":{"$error":"#N/A"}},{"$f":"F181*(VLOOKUP(G182,Konsekvens,2,FALSE))","v":{"$error":"#N/A"}},"",null,{"$f":"N181","v":0}]
[{"$f":"'4. Oönskade händelser'!A99","v":0},null,null,null,null,null,null,"Kvalitet",{"$f":"B183*(VLOOKUP(C183,Konsekvens,2,FALSE))","v":{"$error":"#N/A"}},{"$f":"D183*(VLOOKUP(E183,Konsekvens,2,FALSE))","v":{"$error":"#N/A"}},{"$f":"F183*(VLOOKUP(G183,Konsekvens,2,FALSE))","v":{"$error":"#N/A"}},"",null,{"$f":"IF(A183=0,0,1)","v":0}]
[null,null,null,null,null,null,null,"Leverans",{"$f":"B183*(VLOOKUP(C184,Konsekvens,2,FALSE))","v":{"$error":"#N/A"}},{"$f":"D183*(VLOOKUP(E184,Konsekvens,2,FALSE))","v":{"$error":"#N/A"}},{"$f":"F183*(VLOOKUP(G184,Konsekvens,2,FALSE))","v":{"$error":"#N/A"}},"",null,{"$f":"N183","v":0}]
[{"$f":"'4. Oönskade händelser'!A100","v":0},null,null,null,null,null,null,"Kvalitet",{"$f":"B185*(VLOOKUP(C185,Konsekvens,2,FALSE))","v":{"$error":"#N/A"}},{"$f":"D185*(VLOOKUP(E185,Konsekvens,2,FALSE))","v":{"$error":"#N/A"}},{"$f":"F185*(VLOOKUP(G185,Konsekvens,2,FALSE))","v":{"$error":"#N/A"}},"",null,{"$f":"IF(A185=0,0,1)","v":0}]
[null,null,null,null,null,null,null,"Leverans",{"$f":"B185*(VLOOKUP(C186,Konsekvens,2,FALSE))","v":{"$error":"#N/A"}},{"$f":"D185*(VLOOKUP(E186,Konsekvens,2,FALSE))","v":{"$error":"#N/A"}},{"$f":"F185*(VLOOKUP(G186,Konsekvens,2,FALSE))","v":{"$error":"#N/A"}},"",null,{"$f":"N185","v":0}]
[{"$f":"'4. Oönskade händelser'!A101","v":0},null,null,null,null,null,null,"Kvalitet",{"$f":"B187*(VLOOKUP(C187,Konsekvens,2,FALSE))","v":{"$error":"#N/A"}},{"$f":"D187*(VLOOKUP(E187,Konsekvens,2,FALSE))","v":{"$error":"#N/A"}},{"$f":"F187*(VLOOKUP(G187,Konsekvens,2,FALSE))","v":{"$error":"#N/A"}},"",null,{"$f":"IF(A187=0,0,1)","v":0}]
[null,null,null,null,null,null,null,"Leverans",{"$f":"B187*(VLOOKUP(C188,Konsekvens,2,FALSE))","v":{"$error":"#N/A"}},{"$f":"D187*(VLOOKUP(E188,Konsekvens,2,FALSE))","v":{"$error":"#N/A"}},{"$f":"F187*(VLOOKUP(G188,Konsekvens,2,FALSE))","v":{"$error":"#N/A"}},"",null,{"$f":"N187","v":0}]
[{"$f":"'4. Oönskade händelser'!A102","v":"Tillväxt av mikroorganismer i ledningar som leder till otjänligt vatten "},1,3,2,3,3,3,"Kvalitet",{"$f":"B189*(VLOOKUP(C189,Konsekvens,2,FALSE))","v":10},{"$f":"D189*(VLOOKUP(E189,Konsekvens,2,FALSE))","v":20},{"$f":"F189*(VLOOKUP(G189,Konsekvens,2,FALSE))","v":30},"x",null,{"$f":"IF(A189=0,0,1)","v":1}]
[null,null,1,null,1,null,1,"Leverans",{"$f":"B189*(VLOOKUP(C190,Konsekvens,2,FALSE))","v":1},{"$f":"D189*(VLOOKUP(E190,Konsekvens,2,FALSE))","v":2},{"$f":"F189*(VLOOKUP(G190,Konsekvens,2,FALSE))","v":3},"",null,{"$f":"N189","v":1}]
[{"$f":"'4. Oönskade händelser'!A103","v":0},null,null,null,null,null,null,"Kvalitet",{"$f":"B191*(VLOOKUP(C191,Konsekvens,2,FALSE))","v":{"$error":"#N/A"}},{"$f":"D191*(VLOOKUP(E191,Konsekvens,2,FALSE))","v":{"$error":"#N/A"}},{"$f":"F191*(VLOOKUP(G191,Konsekvens,2,FALSE))","v":{"$error":"#N/A"}},"",null,{"$f":"IF(A191=0,0,1)","v":0}]
[null,null,null,null,null,null,null,"Leverans",{"$f":"B191*(VLOOKUP(C192,Konsekvens,2,FALSE))","v":{"$error":"#N/A"}},{"$f":"D191*(VLOOKUP(E192,Konsekvens,2,FALSE))","v":{"$error":"#N/A"}},{"$f":"F191*(VLOOKUP(G192,Konsekvens,2,FALSE))","v":{"$error":"#N/A"}},"",null,{"$f":"N191","v":0}]
[{"$f":"'4. Oönskade händelser'!A104","v":0},null,null,null,null,null,null,"Kvalitet",{"$f":"B193*(VLOOKUP(C193,Konsekvens,2,FALSE))","v":{"$error":"#N/A"}},{"$f":"D193*(VLOOKUP(E193,Konsekvens,2,FALSE))","v":{"$error":"#N/A"}},{"$f":"F193*(VLOOKUP(G193,Konsekvens,2,FALSE))","v":{"$error":"#N/A"}},"",null,{"$f":"IF(A193=0,0,1)","v":0}]
[null,null,null,null,null,null,null,"Leverans",{"$f":"B193*(VLOOKUP(C194,Konsekvens,2,FALSE))","v":{"$error":"#N/A"}},{"$f":"D193*(VLOOKUP(E194,Konsekvens,2,FALSE))","v":{"$error":"#N/A"}},{"$f":"F193*(VLOOKUP(G194,Konsekvens,2,FALSE))","v":{"$error":"#N/A"}},"",null,{"$f":"N193","v":0}]
[{"$f":"'4. Oönskade händelser'!A105","v":0},null,null,null,null,null,null,"Kvalitet",{"$f":"B195*(VLOOKUP(C195,Konsekvens,2,FALSE))","v":{"$error":"#N/A"}},{"$f":"D195*(VLOOKUP(E195,Konsekvens,2,FALSE))","v":{"$error":"#N/A"}},{"$f":"F195*(VLOOKUP(G195,Konsekvens,2,FALSE))","v":{"$error":"#N/A"}},"",null,{"$f":"IF(A195=0,0,1)","v":0}]
[null,null,null,null,null,null,null,"Leverans",{"$f":"B195*(VLOOKUP(C196,Konsekvens,2,FALSE))","v":{"$error":"#N/A"}},{"$f":"D195*(VLOOKUP(E196,Konsekvens,2,FALSE))","v":{"$error":"#N/A"}},{"$f":"F195*(VLOOKUP(G196,Konsekvens,2,FALSE))","v":{"$error":"#N/A"}},"",null,{"$f":"N195","v":0}]
[{"$f":"'4. Oönskade händelser'!A106","v":0},null,null,null,null,null,null,"Kvalitet",{"$f":"B197*(VLOOKUP(C197,Konsekvens,2,FALSE))","v":{"$error":"#N/A"}},{"$f":"D197*(VLOOKUP(E197,Konsekvens,2,FALSE))","v":{"$error":"#N/A"}},{"$f":"F197*(VLOOKUP(G197,Konsekvens,2,FALSE))","v":{"$error":"#N/A"}},"",null,{"$f":"IF(A197=0,0,1)","v":0}]
[null,null,null,null,null,null,null,"Leverans",{"$f":"B197*(VLOOKUP(C198,Konsekvens,2,FALSE))","v":{"$error":"#N/A"}},{"$f":"D197*(VLOOKUP(E198,Konsekvens,2,FALSE))","v":{"$error":"#N/A"}},{"$f":"F197*(VLOOKUP(G198,Konsekvens,2,FALSE))","v":{"$error":"#N/A"}},"",null,{"$f":"N197","v":0}]
[{"$f":"'4. Oönskade händelser'!A107","v":0},null,null,null,null,null,null,"Kvalitet",{"$f":"B199*(VLOOKUP(C199,Konsekvens,2,FALSE))","v":{"$error":"#N/A"}},{"$f":"D199*(VLOOKUP(E199,Konsekvens,2,FALSE))","v":{"$error":"#N/A"}},{"$f":"F199*(VLOOKUP(G199,Konsekvens,2,FALSE))","v":{"$error":"#N/A"}},"",null,{"$f":"IF(A199=0,0,1)","v":0}]
[null,null,null,null,null,null,null,"Leverans",{"$f":"B199*(VLOOKUP(C200,Konsekvens,2,FALSE))","v":{"$error":"#N/A"}},{"$f":"D199*(VLOOKUP(E200,Konsekvens,2,FALSE))","v":{"$error":"#N/A"}},{"$f":"F199*(VLOOKUP(G200,Konsekvens,2,FALSE))","v":{"$error":"#N/A"}},"",null,{"$f":"N199","v":0}]
[{"$f":"'4. Oönskade händelser'!A108","v":0},null,null,null,null,null,null,"Kvalitet",{"$f":"B201*(VLOOKUP(C201,Konsekvens,2,FALSE))","v":{"$error":"#N/A"}},{"$f":"D201*(VLOOKUP(E201,Konsekvens,2,FALSE))","v":{"$error":"#N/A"}},{"$f":"F201*(VLOOKUP(G201,Konsekvens,2,FALSE))","v":{"$error":"#N/A"}},{"$f":"IFERROR(IF(I201>10,\"x\",IF(J201>10,\"x\",IF(K201>10,\"x\",\"\"))),\"\")","v":""},null,{"$f":"IF(A201=0,0,1)","v":0}]
[null,null,null,null,null,null,null,"Leverans",{"$f":"B201*(VLOOKUP(C202,Konsekvens,2,FALSE))","v":{"$error":"#N/A"}},{"$f":"D201*(VLOOKUP(E202,Konsekvens,2,FALSE))","v":{"$error":"#N/A"}},{"$f":"F201*(VLOOKUP(G202,Konsekvens,2,FALSE))","v":{"$error":"#N/A"}},"",null,{"$f":"N201","v":0}]
[{"$f":"'4. Oönskade händelser'!A109","v":0},null,null,null,null,null,null,"Kvalitet",{"$f":"B203*(VLOOKUP(C203,Konsekvens,2,FALSE))","v":{"$error":"#N/A"}},{"$f":"D203*(VLOOKUP(E203,Konsekvens,2,FALSE))","v":{"$error":"#N/A"}},{"$f":"F203*(VLOOKUP(G203,Konsekvens,2,FALSE))","v":{"$error":"#N/A"}},"",null,{"$f":"IF(A203=0,0,1)","v":0}]
[null,null,null,null,null,null,null,"Leverans",{"$f":"B203*(VLOOKUP(C204,Konsekvens,2,FALSE))","v":{"$error":"#N/A"}},{"$f":"D203*(VLOOKUP(E204,Konsekvens,2,FALSE))","v":{"$error":"#N/A"}},{"$f":"F203*(VLOOKUP(G204,Konsekvens,2,FALSE))","v":{"$error":"#N/A"}},"",null,{"$f":"N203","v":0}]
[{"$f":"'4. Oönskade händelser'!A110","v":0},null,null,null,null,null,null,"Kvalitet",{"$f":"B205*(VLOOKUP(C205,Konsekvens,2,FALSE))","v":{"$error":"#N/A"}},{"$f":"D205*(VLOOKUP(E205,Konsekvens,2,FALSE))","v":{"$error":"#N/A"}},{"$f":"F205*(VLOOKUP(G205,Konsekvens,2,FALSE))","v":{"$error":"#N/A"}},"",null,{"$f":"IF(A205=0,0,1)","v":0}]
[null,null,null,null,null,null,null,"Leverans",{"$f":"B205*(VLOOKUP(C206,Konsekvens,2,FALSE))","v":{"$error":"#N/A"}},{"$f":"D205*(VLOOKUP(E206,Konsekvens,2,FALSE))","v":{"$error":"#N/A"}},{"$f":"F205*(VLOOKUP(G206,Konsekvens,2,FALSE))","v":{"$error":"#N/A"}},"",null,{"$f":"N205","v":0}]
[{"$f":"'4. Oönskade händelser'!A111","v":"Översvämning av anläggningsdelar som leder till inläckage av ytvatten och därmed försämrad råvattenkvalitet. "},1,3,1,3,2,3,"Kvalitet",{"$f":"B207*(VLOOKUP(C207,Konsekvens,2,FALSE))","v":10},{"$f":"D207*(VLOOKUP(E207,Konsekvens,2,FALSE))","v":10},{"$f":"F207*(VLOOKUP(G207,Konsekvens,2,FALSE))","v":20},"x",null,{"$f":"IF(A207=0,0,1)","v":1}]
[null,null,1,null,1,null,1,"Leverans",{"$f":"B207*(VLOOKUP(C208,Konsekvens,2,FALSE))","v":1},{"$f":"D207*(VLOOKUP(E208,Konsekvens,2,FALSE))","v":1},{"$f":"F207*(VLOOKUP(G208,Konsekvens,2,FALSE))","v":2},"",null,{"$f":"N207","v":1}]
[{"$f":"'4. Oönskade händelser'!A112","v":0},null,null,null,null,null,null,"Kvalitet",{"$f":"B209*(VLOOKUP(C209,Konsekvens,2,FALSE))","v":{"$error":"#N/A"}},{"$f":"D209*(VLOOKUP(E209,Konsekvens,2,FALSE))","v":{"$error":"#N/A"}},{"$f":"F209*(VLOOKUP(G209,Konsekvens,2,FALSE))","v":{"$error":"#N/A"}},"",null,{"$f":"IF(A209=0,0,1)","v":0}]
[null,null,null,null,null,null,null,"Leverans",{"$f":"B209*(VLOOKUP(C210,Konsekvens,2,FALSE))","v":{"$error":"#N/A"}},{"$f":"D209*(VLOOKUP(E210,Konsekvens,2,FALSE))","v":{"$error":"#N/A"}},{"$f":"F209*(VLOOKUP(G210,Konsekvens,2,FALSE))","v":{"$error":"#N/A"}},"",null,{"$f":"N209","v":0}]
[{"$f":"'4. Oönskade händelser'!A113","v":0},null,null,null,null,null,null,"Kvalitet",{"$f":"B211*(VLOOKUP(C211,Konsekvens,2,FALSE))","v":{"$error":"#N/A"}},{"$f":"D211*(VLOOKUP(E211,Konsekvens,2,FALSE))","v":{"$error":"#N/A"}},{"$f":"F211*(VLOOKUP(G211,Konsekvens,2,FALSE))","v":{"$error":"#N/A"}},"",null,{"$f":"IF(A211=0,0,1)","v":0}]
[null,null,null,null,null,null,null,"Leverans",{"$f":"B211*(VLOOKUP(C212,Konsekvens,2,FALSE))","v":{"$error":"#N/A"}},{"$f":"D211*(VLOOKUP(E212,Konsekvens,2,FALSE))","v":{"$error":"#N/A"}},{"$f":"F211*(VLOOKUP(G212,Konsekvens,2,FALSE))","v":{"$error":"#N/A"}},"",null,{"$f":"N211","v":0}]
[{"$f":"'4. Oönskade händelser'!A114","v":0},null,null,null,null,null,null,"Kvalitet",{"$f":"B213*(VLOOKUP(C213,Konsekvens,2,FALSE))","v":{"$error":"#N/A"}},{"$f":"D213*(VLOOKUP(E213,Konsekvens,2,FALSE))","v":{"$error":"#N/A"}},{"$f":"F213*(VLOOKUP(G213,Konsekvens,2,FALSE))","v":{"$error":"#N/A"}},"",null,{"$f":"IF(A213=0,0,1)","v":0}]
[null,null,null,null,null,null,null,"Leverans",{"$f":"B213*(VLOOKUP(C214,Konsekvens,2,FALSE))","v":{"$error":"#N/A"}},{"$f":"D213*(VLOOKUP(E214,Konsekvens,2,FALSE))","v":{"$error":"#N/A"}},{"$f":"F213*(VLOOKUP(G214,Konsekvens,2,FALSE))","v":{"$error":"#N/A"}},"",null,{"$f":"N213","v":0}]
[{"$f":"'4. Oönskade händelser'!A115","v":0},null,null,null,null,null,null,"Kvalitet",{"$f":"B215*(VLOOKUP(C215,Konsekvens,2,FALSE))","v":{"$error":"#N/A"}},{"$f":"D215*(VLOOKUP(E215,Konsekvens,2,FALSE))","v":{"$error":"#N/A"}},{"$f":"F215*(VLOOKUP(G215,Konsekvens,2,FALSE))","v":{"$error":"#N/A"}},"",null,{"$f":"IF(A215=0,0,1)","v":0}]
[null,null,null,null,null,null,null,"Leverans",{"$f":"B215*(VLOOKUP(C216,Konsekvens,2,FALSE))","v":{"$error":"#N/A"}},{"$f":"D215*(VLOOKUP(E216,Konsekvens,2,FALSE))","v":{"$error":"#N/A"}},{"$f":"F215*(VLOOKUP(G216,Konsekvens,2,FALSE))","v":{"$error":"#N/A"}},"",null,{"$f":"N215","v":0}]
[{"$f":"'4. Oönskade händelser'!A116","v":0},null,null,null,null,null,null,"Kvalitet",{"$f":"B217*(VLOOKUP(C217,Konsekvens,2,FALSE))","v":{"$error":"#N/A"}},{"$f":"D217*(VLOOKUP(E217,Konsekvens,2,FALSE))","v":{"$error":"#N/A"}},{"$f":"F217*(VLOOKUP(G217,Konsekvens,2,FALSE))","v":{"$error":"#N/A"}},"",null,{"$f":"IF(A217=0,0,1)","v":0}]
[null,null,null,null,null,null,null,"Leverans",{"$f":"B217*(VLOOKUP(C218,Konsekvens,2,FALSE))","v":{"$error":"#N/A"}},{"$f":"D217*(VLOOKUP(E218,Konsekvens,2,FALSE))","v":{"$error":"#N/A"}},{"$f":"F217*(VLOOKUP(G218,Konsekvens,2,FALSE))","v":{"$error":"#N/A"}},"",null,{"$f":"N217","v":0}]
[{"$f":"'4. Oönskade händelser'!A117","v":0},null,null,null,null,null,null,"Kvalitet",{"$f":"B219*(VLOOKUP(C219,Konsekvens,2,FALSE))","v":{"$error":"#N/A"}},{"$f":"D219*(VLOOKUP(E219,Konsekvens,2,FALSE))","v":{"$error":"#N/A"}},{"$f":"F219*(VLOOKUP(G219,Konsekvens,2,FALSE))","v":{"$error":"#N/A"}},"",null,{"$f":"IF(A219=0,0,1)","v":0}]
[null,null,null,null,null,null,null,"Leverans",{"$f":"B219*(VLOOKUP(C220,Konsekvens,2,FALSE))","v":{"$error":"#N/A"}},{"$f":"D219*(VLOOKUP(E220,Konsekvens,2,FALSE))","v":{"$error":"#N/A"}},{"$f":"F219*(VLOOKUP(G220,Konsekvens,2,FALSE))","v":{"$error":"#N/A"}},"",null,{"$f":"N219","v":0}]
[{"$f":"'4. Oönskade händelser'!A118","v":0},null,null,null,null,null,null,"Kvalitet",{"$f":"B221*(VLOOKUP(C221,Konsekvens,2,FALSE))","v":{"$error":"#N/A"}},{"$f":"D221*(VLOOKUP(E221,Konsekvens,2,FALSE))","v":{"$error":"#N/A"}},{"$f":"F221*(VLOOKUP(G221,Konsekvens,2,FALSE))","v":{"$error":"#N/A"}},"",null,{"$f":"IF(A221=0,0,1)","v":0}]
[null,null,null,null,null,null,null,"Leverans",{"$f":"B221*(VLOOKUP(C222,Konsekvens,2,FALSE))","v":{"$error":"#N/A"}},{"$f":"D221*(VLOOKUP(E222,Konsekvens,2,FALSE))","v":{"$error":"#N/A"}},{"$f":"F221*(VLOOKUP(G222,Konsekvens,2,FALSE))","v":{"$error":"#N/A"}},"",null,{"$f":"N221","v":0}]
[{"$f":"'4. Oönskade händelser'!A119","v":0},null,null,null,null,null,null,"Kvalitet",{"$f":"B223*(VLOOKUP(C223,Konsekvens,2,FALSE))","v":{"$error":"#N/A"}},{"$f":"D223*(VLOOKUP(E223,Konsekvens,2,FALSE))","v":{"$error":"#N/A"}},{"$f":"F223*(VLOOKUP(G223,Konsekvens,2,FALSE))","v":{"$error":"#N/A"}},"",null,{"$f":"IF(A223=0,0,1)","v":0}]
[null,null,null,null,null,null,null,"Leverans",{"$f":"B223*(VLOOKUP(C224,Konsekvens,2,FALSE))","v":{"$error":"#N/A"}},{"$f":"D223*(VLOOKUP(E224,Konsekvens,2,FALSE))","v":{"$error":"#N/A"}},{"$f":"F223*(VLOOKUP(G224,Konsekvens,2,FALSE))","v":{"$error":"#N/A"}},"",null,{"$f":"N223","v":0}]
[{"$f":"'4. Oönskade händelser'!A120","v":0},null,null,null,null,null,null,"Kvalitet",{"$f":"B225*(VLOOKUP(C225,Konsekvens,2,FALSE))","v":{"$error":"#N/A"}},{"$f":"D225*(VLOOKUP(E225,Konsekvens,2,FALSE))","v":{"$error":"#N/A"}},{"$f":"F225*(VLOOKUP(G225,Konsekvens,2,FALSE))","v":{"$error":"#N/A"}},"",null,{"$f":"IF(A225=0,0,1)","v":0}]
[null,null,null,null,null,null,null,"Leverans",{"$f":"B225*(VLOOKUP(C226,Konsekvens,2,FALSE))","v":{"$error":"#N/A"}},{"$f":"D225*(VLOOKUP(E226,Konsekvens,2,FALSE))","v":{"$error":"#N/A"}},{"$f":"F225*(VLOOKUP(G226,Konsekvens,2,FALSE))","v":{"$error":"#N/A"}},"",null,{"$f":"N225","v":0}]
[{"$f":"'4. Oönskade händelser'!A121","v":0},null,null,null,null,null,null,"Kvalitet",{"$f":"B227*(VLOOKUP(C227,Konsekvens,2,FALSE))","v":{"$error":"#N/A"}},{"$f":"D227*(VLOOKUP(E227,Konsekvens,2,FALSE))","v":{"$error":"#N/A"}},{"$f":"F227*(VLOOKUP(G227,Konsekvens,2,FALSE))","v":{"$error":"#N/A"}},"",null,{"$f":"IF(A227=0,0,1)","v":0}]
[null,null,null,null,null,null,null,"Leverans",{"$f":"B227*(VLOOKUP(C228,Konsekvens,2,FALSE))","v":{"$error":"#N/A"}},{"$f":"D227*(VLOOKUP(E228,Konsekvens,2,FALSE))","v":{"$error":"#N/A"}},{"$f":"F227*(VLOOKUP(G228,Konsekvens,2,FALSE))","v":{"$error":"#N/A"}},"",null,{"$f":"N227","v":0}]
[{"$f":"'4. Oönskade händelser'!A122","v":0},null,null,null,null,null,null,"Kvalitet",{"$f":"B229*(VLOOKUP(C229,Konsekvens,2,FALSE))","v":{"$error":"#N/A"}},{"$f":"D229*(VLOOKUP(E229,Konsekvens,2,FALSE))","v":{"$error":"#N/A"}},{"$f":"F229*(VLOOKUP(G229,Konsekvens,2,FALSE))","v":{"$error":"#N/A"}},"",null,{"$f":"IF(A229=0,0,1)","v":0}]
[null,null,null,null,null,null,null,"Leverans",{"$f":"B229*(VLOOKUP(C230,Konsekvens,2,FALSE))","v":{"$error":"#N/A"}},{"$f":"D229*(VLOOKUP(E230,Konsekvens,2,FALSE))","v":{"$error":"#N/A"}},{"$f":"F229*(VLOOKUP(G230,Konsekvens,2,FALSE))","v":{"$error":"#N/A"}},"",null,{"$f":"N229","v":0}]
[{"$f":"'4. Oönskade händelser'!A123","v":0},null,null,null,null,null,null,"Kvalitet",{"$f":"B231*(VLOOKUP(C231,Konsekvens,2,FALSE))","v":{"$error":"#N/A"}},{"$f":"D231*(VLOOKUP(E231,Konsekvens,2,FALSE))","v":{"$error":"#N/A"}},{"$f":"F231*(VLOOKUP(G231,Konsekvens,2,FALSE))","v":{"$error":"#N/A"}},"",null,{"$f":"IF(A231=0,0,1)","v":0}]
[null,null,null,null,null,null,null,"Leverans",{"$f":"B231*(VLOOKUP(C232,Konsekvens,2,FALSE))","v":{"$error":"#N/A"}},{"$f":"D231*(VLOOKUP(E232,Konsekvens,2,FALSE))","v":{"$error":"#N/A"}},{"$f":"F231*(VLOOKUP(G232,Konsekvens,2,FALSE))","v":{"$error":"#N/A"}},"",null,{"$f":"N231","v":0}]
[{"$f":"'4. Oönskade händelser'!A124","v":0},null,null,null,null,null,null,"Kvalitet",{"$f":"B233*(VLOOKUP(C233,Konsekvens,2,FALSE))","v":{"$error":"#N/A"}},{"$f":"D233*(VLOOKUP(E233,Konsekvens,2,FALSE))","v":{"$error":"#N/A"}},{"$f":"F233*(VLOOKUP(G233,Konsekvens,2,FALSE))","v":{"$error":"#N/A"}},"",null,{"$f":"IF(A233=0,0,1)","v":0}]
[null,null,null,null,null,null,null,"Leverans",{"$f":"B233*(VLOOKUP(C234,Konsekvens,2,FALSE))","v":{"$error":"#N/A"}},{"$f":"D233*(VLOOKUP(E234,Konsekvens,2,FALSE))","v":{"$error":"#N/A"}},{"$f":"F233*(VLOOKUP(G234,Konsekvens,2,FALSE))","v":{"$error":"#N/A"}},"",null,{"$f":"N233","v":0}]
[{"$f":"'4. Oönskade händelser'!A125","v":0},null,null,null,null,null,null,"Kvalitet",{"$f":"B235*(VLOOKUP(C235,Konsekvens,2,FALSE))","v":{"$error":"#N/A"}},{"$f":"D235*(VLOOKUP(E235,Konsekvens,2,FALSE))","v":{"$error":"#N/A"}},{"$f":"F235*(VLOOKUP(G235,Konsekvens,2,FALSE))","v":{"$error":"#N/A"}},"",null,{"$f":"IF(A235=0,0,1)","v":0}]
[null,null,null,null,null,null,null,"Leverans",{"$f":"B235*(VLOOKUP(C236,Konsekvens,2,FALSE))","v":{"$error":"#N/A"}},{"$f":"D235*(VLOOKUP(E236,Konsekvens,2,FALSE))","v":{"$error":"#N/A"}},{"$f":"F235*(VLOOKUP(G236,Konsekvens,2,FALSE))","v":{"$error":"#N/A"}},"",null,{"$f":"N235","v":0}]
[{"$f":"'4. Oönskade händelser'!A126","v":0},null,null,null,null,null,null,"Kvalitet",{"$f":"B237*(VLOOKUP(C237,Konsekvens,2,FALSE))","v":{"$error":"#N/A"}},{"$f":"D237*(VLOOKUP(E237,Konsekvens,2,FALSE))","v":{"$error":"#N/A"}},{"$f":"F237*(VLOOKUP(G237,Konsekvens,2,FALSE))","v":{"$error":"#N/A"}},"",null,{"$f":"IF(A237=0,0,1)","v":0}]
[null,null,null,null,null,null,null,"Leverans",{"$f":"B237*(VLOOKUP(C238,Konsekvens,2,FALSE))","v":{"$error":"#N/A"}},{"$f":"D237*(VLOOKUP(E238,Konsekvens,2,FALSE))","v":{"$error":"#N/A"}},{"$f":"F237*(VLOOKUP(G238,Konsekvens,2,FALSE))","v":{"$error":"#N/A"}},"",null,{"$f":"N237","v":0}]
[{"$f":"'4. Oönskade händelser'!A127","v":0},null,null,null,null,null,null,"Kvalitet",{"$f":"B239*(VLOOKUP(C239,Konsekvens,2,FALSE))","v":{"$error":"#N/A"}},{"$f":"D239*(VLOOKUP(E239,Konsekvens,2,FALSE))","v":{"$error":"#N/A"}},{"$f":"F239*(VLOOKUP(G239,Konsekvens,2,FALSE))","v":{"$error":"#N/A"}},"",null,{"$f":"IF(A239=0,0,1)","v":0}]
[null,null,null,null,null,null,null,"Leverans",{"$f":"B239*(VLOOKUP(C240,Konsekvens,2,FALSE))","v":{"$error":"#N/A"}},{"$f":"D239*(VLOOKUP(E240,Konsekvens,2,FALSE))","v":{"$error":"#N/A"}},{"$f":"F239*(VLOOKUP(G240,Konsekvens,2,FALSE))","v":{"$error":"#N/A"}},"",null,{"$f":"N239","v":0}]
[{"$f":"'4. Oönskade händelser'!A128","v":0},null,null,null,null,null,null,"Kvalitet",{"$f":"B241*(VLOOKUP(C241,Konsekvens,2,FALSE))","v":{"$error":"#N/A"}},{"$f":"D241*(VLOOKUP(E241,Konsekvens,2,FALSE))","v":{"$error":"#N/A"}},{"$f":"F241*(VLOOKUP(G241,Konsekvens,2,FALSE))","v":{"$error":"#N/A"}},"",null,{"$f":"IF(A241=0,0,1)","v":0}]
[null,null,null,null,null,null,null,"Leverans",{"$f":"B241*(VLOOKUP(C242,Konsekvens,2,FALSE))","v":{"$error":"#N/A"}},{"$f":"D241*(VLOOKUP(E242,Konsekvens,2,FALSE))","v":{"$error":"#N/A"}},{"$f":"F241*(VLOOKUP(G242,Konsekvens,2,FALSE))","v":{"$error":"#N/A"}},"",null,{"$f":"N241","v":0}]
[{"$f":"'4. Oönskade händelser'!A129","v":0},null,null,null,null,null,null,"Kvalitet",{"$f":"B243*(VLOOKUP(C243,Konsekvens,2,FALSE))","v":{"$error":"#N/A"}},{"$f":"D243*(VLOOKUP(E243,Konsekvens,2,FALSE))","v":{"$error":"#N/A"}},{"$f":"F243*(VLOOKUP(G243,Konsekvens,2,FALSE))","v":{"$error":"#N/A"}},"",null,{"$f":"IF(A243=0,0,1)","v":0}]
[null,null,null,null,null,null,null,"Leverans",{"$f":"B243*(VLOOKUP(C244,Konsekvens,2,FALSE))","v":{"$error":"#N/A"}},{"$f":"D243*(VLOOKUP(E244,Konsekvens,2,FALSE))","v":{"$error":"#N/A"}},{"$f":"F243*(VLOOKUP(G244,Konsekvens,2,FALSE))","v":{"$error":"#N/A"}},"",null,{"$f":"N243","v":0}]
[{"$f":"'4. Oönskade händelser'!A130","v":0},null,null,null,null,null,null,"Kvalitet",{"$f":"B245*(VLOOKUP(C245,Konsekvens,2,FALSE))","v":{"$error":"#N/A"}},{"$f":"D245*(VLOOKUP(E245,Konsekvens,2,FALSE))","v":{"$error":"#N/A"}},{"$f":"F245*(VLOOKUP(G245,Konsekvens,2,FALSE))","v":{"$error":"#N/A"}},"",null,{"$f":"IF(A245=0,0,1)","v":0}]
[null,null,null,null,null,null,null,"Leverans",{"$f":"B245*(VLOOKUP(C246,Konsekvens,2,FALSE))","v":{"$error":"#N/A"}},{"$f":"D245*(VLOOKUP(E246,Konsekvens,2,FALSE))","v":{"$error":"#N/A"}},{"$f":"F245*(VLOOKUP(G246,Konsekvens,2,FALSE))","v":{"$error":"#N/A"}},"",null,{"$f":"N245","v":0}]
[{"$f":"'4. Oönskade händelser'!A131","v":0},null,null,null,null,null,null,"Kvalitet",{"$f":"B247*(VLOOKUP(C247,Konsekvens,2,FALSE))","v":{"$error":"#N/A"}},{"$f":"D247*(VLOOKUP(E247,Konsekvens,2,FALSE))","v":{"$error":"#N/A"}},{"$f":"F247*(VLOOKUP(G247,Konsekvens,2,FALSE))","v":{"$error":"#N/A"}},"",null,{"$f":"IF(A247=0,0,1)","v":0}]
[null,null,null,null,null,null,null,"Leverans",{"$f":"B247*(VLOOKUP(C248,Konsekvens,2,FALSE))","v":{"$error":"#N/A"}},{"$f":"D247*(VLOOKUP(E248,Konsekvens,2,FALSE))","v":{"$error":"#N/A"}},{"$f":"F247*(VLOOKUP(G248,Konsekvens,2,FALSE))","v":{"$error":"#N/A"}},"",null,{"$f":"N247","v":0}]
[{"$f":"'4. Oönskade händelser'!A132","v":0},null,null,null,null,null,null,"Kvalitet",{"$f":"B249*(VLOOKUP(C249,Konsekvens,2,FALSE))","v":{"$error":"#N/A"}},{"$f":"D249*(VLOOKUP(E249,Konsekvens,2,FALSE))","v":{"$error":"#N/A"}},{"$f":"F249*(VLOOKUP(G249,Konsekvens,2,FALSE))","v":{"$error":"#N/A"}},"",null,{"$f":"IF(A249=0,0,1)","v":0}]
[null,null,null,null,null,null,null,"Leverans",{"$f":"B249*(VLOOKUP(C250,Konsekvens,2,FALSE))","v":{"$error":"#N/A"}},{"$f":"D249*(VLOOKUP(E250,Konsekvens,2,FALSE))","v":{"$error":"#N/A"}},{"$f":"F249*(VLOOKUP(G250,Konsekvens,2,FALSE))","v":{"$error":"#N/A"}},"",null,{"$f":"N249","v":0}]
[{"$f":"'4. Oönskade händelser'!A133","v":0},null,null,null,null,null,null,"Kvalitet",{"$f":"B251*(VLOOKUP(C251,Konsekvens,2,FALSE))","v":{"$error":"#N/A"}},{"$f":"D251*(VLOOKUP(E251,Konsekvens,2,FALSE))","v":{"$error":"#N/A"}},{"$f":"F251*(VLOOKUP(G251,Konsekvens,2,FALSE))","v":{"$error":"#N/A"}},"",null,{"$f":"IF(A251=0,0,1)","v":0}]
[null,null,null,null,null,null,null,"Leverans",{"$f":"B251*(VLOOKUP(C252,Konsekvens,2,FALSE))","v":{"$error":"#N/A"}},{"$f":"D251*(VLOOKUP(E252,Konsekvens,2,FALSE))","v":{"$error":"#N/A"}},{"$f":"F251*(VLOOKUP(G252,Konsekvens,2,FALSE))","v":{"$error":"#N/A"}},"",null,{"$f":"N251","v":0}]
[{"$f":"'4. Oönskade händelser'!A134","v":0},null,null,null,null,null,null,"Kvalitet",{"$f":"B253*(VLOOKUP(C253,Konsekvens,2,FALSE))","v":{"$error":"#N/A"}},{"$f":"D253*(VLOOKUP(E253,Konsekvens,2,FALSE))","v":{"$error":"#N/A"}},{"$f":"F253*(VLOOKUP(G253,Konsekvens,2,FALSE))","v":{"$error":"#N/A"}},"",null,{"$f":"IF(A253=0,0,1)","v":0}]
[null,null,null,null,null,null,null,"Leverans",{"$f":"B253*(VLOOKUP(C254,Konsekvens,2,FALSE))","v":{"$error":"#N/A"}},{"$f":"D253*(VLOOKUP(E254,Konsekvens,2,FALSE))","v":{"$error":"#N/A"}},{"$f":"F253*(VLOOKUP(G254,Konsekvens,2,FALSE))","v":{"$error":"#N/A"}},"",null,{"$f":"N253","v":0}]
[{"$f":"'4. Oönskade händelser'!A135","v":0},null,null,null,null,null,null,"Kvalitet",{"$f":"B255*(VLOOKUP(C255,Konsekvens,2,FALSE))","v":{"$error":"#N/A"}},{"$f":"D255*(VLOOKUP(E255,Konsekvens,2,FALSE))","v":{"$error":"#N/A"}},{"$f":"F255*(VLOOKUP(G255,Konsekvens,2,FALSE))","v":{"$error":"#N/A"}},"",null,{"$f":"IF(A255=0,0,1)","v":0}]
[null,null,null,null,null,null,null,"Leverans",{"$f":"B255*(VLOOKUP(C256,Konsekvens,2,FALSE))","v":{"$error":"#N/A"}},{"$f":"D255*(VLOOKUP(E256,Konsekvens,2,FALSE))","v":{"$error":"#N/A"}},{"$f":"F255*(VLOOKUP(G256,Konsekvens,2,FALSE))","v":{"$error":"#N/A"}},"",null,{"$f":"N255","v":0}]
[{"$f":"'4. Oönskade händelser'!A136","v":0},null,null,null,null,null,null,"Kvalitet",{"$f":"B257*(VLOOKUP(C257,Konsekvens,2,FALSE))","v":{"$error":"#N/A"}},{"$f":"D257*(VLOOKUP(E257,Konsekvens,2,FALSE))","v":{"$error":"#N/A"}},{"$f":"F257*(VLOOKUP(G257,Konsekvens,2,FALSE))","v":{"$error":"#N/A"}},"",null,{"$f":"IF(A257=0,0,1)","v":0}]
[null,null,null,null,null,null,null,"Leverans",{"$f":"B257*(VLOOKUP(C258,Konsekvens,2,FALSE))","v":{"$error":"#N/A"}},{"$f":"D257*(VLOOKUP(E258,Konsekvens,2,FALSE))","v":{"$error":"#N/A"}},{"$f":"F257*(VLOOKUP(G258,Konsekvens,2,FALSE))","v":{"$error":"#N/A"}},"",null,{"$f":"N257","v":0}]
[{"$f":"'4. Oönskade händelser'!A137","v":0},null,null,null,null,null,null,"Kvalitet",{"$f":"B259*(VLOOKUP(C259,Konsekvens,2,FALSE))","v":{"$error":"#N/A"}},{"$f":"D259*(VLOOKUP(E259,Konsekvens,2,FALSE))","v":{"$error":"#N/A"}},{"$f":"F259*(VLOOKUP(G259,Konsekvens,2,FALSE))","v":{"$error":"#N/A"}},"",null,{"$f":"IF(A259=0,0,1)","v":0}]
[null,null,null,null,null,null,null,"Leverans",{"$f":"B259*(VLOOKUP(C260,Konsekvens,2,FALSE))","v":{"$error":"#N/A"}},{"$f":"D259*(VLOOKUP(E260,Konsekvens,2,FALSE))","v":{"$error":"#N/A"}},{"$f":"F259*(VLOOKUP(G260,Konsekvens,2,FALSE))","v":{"$error":"#N/A"}},"",null,{"$f":"N259","v":0}]
[{"$f":"'4. Oönskade händelser'!A138","v":0},null,null,null,null,null,null,"Kvalitet",{"$f":"B261*(VLOOKUP(C261,Konsekvens,2,FALSE))","v":{"$error":"#N/A"}},{"$f":"D261*(VLOOKUP(E261,Konsekvens,2,FALSE))","v":{"$error":"#N/A"}},{"$f":"F261*(VLOOKUP(G261,Konsekvens,2,FALSE))","v":{"$error":"#N/A"}},"",null,{"$f":"IF(A261=0,0,1)","v":0}]
[null,null,null,null,null,null,null,"Leverans",{"$f":"B261*(VLOOKUP(C262,Konsekvens,2,FALSE))","v":{"$error":"#N/A"}},{"$f":"D261*(VLOOKUP(E262,Konsekvens,2,FALSE))","v":{"$error":"#N/A"}},{"$f":"F261*(VLOOKUP(G262,Konsekvens,2,FALSE))","v":{"$error":"#N/A"}},"",null,{"$f":"N261","v":0}]
[{"$f":"'4. Oönskade händelser'!A139","v":0},null,null,null,null,null,null,"Kvalitet",{"$f":"B263*(VLOOKUP(C263,Konsekvens,2,FALSE))","v":{"$error":"#N/A"}},{"$f":"D263*(VLOOKUP(E263,Konsekvens,2,FALSE))","v":{"$error":"#N/A"}},{"$f":"F263*(VLOOKUP(G263,Konsekvens,2,FALSE))","v":{"$error":"#N/A"}},"",null,{"$f":"IF(A263=0,0,1)","v":0}]
[null,null,null,null,null,null,null,"Leverans",{"$f":"B263*(VLOOKUP(C264,Konsekvens,2,FALSE))","v":{"$error":"#N/A"}},{"$f":"D263*(VLOOKUP(E264,Konsekvens,2,FALSE))","v":{"$error":"#N/A"}},{"$f":"F263*(VLOOKUP(G264,Konsekvens,2,FALSE))","v":{"$error":"#N/A"}},"",null,{"$f":"N263","v":0}]
[{"$f":"'4. Oönskade händelser'!A140","v":0},null,null,null,null,null,null,"Kvalitet",{"$f":"B265*(VLOOKUP(C265,Konsekvens,2,FALSE))","v":{"$error":"#N/A"}},{"$f":"D265*(VLOOKUP(E265,Konsekvens,2,FALSE))","v":{"$error":"#N/A"}},{"$f":"F265*(VLOOKUP(G265,Konsekvens,2,FALSE))","v":{"$error":"#N/A"}},{"$f":"IFERROR(IF(I265>10,\"x\",IF(J265>10,\"x\",IF(K265>10,\"x\",\"\"))),\"\")","v":""},null,{"$f":"IF(A265=0,0,1)","v":0}]
[null,null,null,null,null,null,null,"Leverans",{"$f":"B265*(VLOOKUP(C266,Konsekvens,2,FALSE))","v":{"$error":"#N/A"}},{"$f":"D265*(VLOOKUP(E266,Konsekvens,2,FALSE))","v":{"$error":"#N/A"}},{"$f":"F265*(VLOOKUP(G266,Konsekvens,2,FALSE))","v":{"$error":"#N/A"}},"",null,{"$f":"N265","v":0}]
[{"$f":"'4. Oönskade händelser'!A141","v":0},null,null,null,null,null,null,"Kvalitet",{"$f":"B267*(VLOOKUP(C267,Konsekvens,2,FALSE))","v":{"$error":"#N/A"}},{"$f":"D267*(VLOOKUP(E267,Konsekvens,2,FALSE))","v":{"$error":"#N/A"}},{"$f":"F267*(VLOOKUP(G267,Konsekvens,2,FALSE))","v":{"$error":"#N/A"}},"",null,{"$f":"IF(A267=0,0,1)","v":0}]
[null,null,null,null,null,null,null,"Leverans",{"$f":"B267*(VLOOKUP(C268,Konsekvens,2,FALSE))","v":{"$error":"#N/A"}},{"$f":"D267*(VLOOKUP(E268,Konsekvens,2,FALSE))","v":{"$error":"#N/A"}},{"$f":"F267*(VLOOKUP(G268,Konsekvens,2,FALSE))","v":{"$error":"#N/A"}},"",null,{"$f":"N267","v":0}]
[{"$f":"'4. Oönskade händelser'!A142","v":0},null,null,null,null,null,null,"Kvalitet",{"$f":"B269*(VLOOKUP(C269,Konsekvens,2,FALSE))","v":{"$error":"#N/A"}},{"$f":"D269*(VLOOKUP(E269,Konsekvens,2,FALSE))","v":{"$error":"#N/A"}},{"$f":"F269*(VLOOKUP(G269,Konsekvens,2,FALSE))","v":{"$error":"#N/A"}},"",null,{"$f":"IF(A269=0,0,1)","v":0}]
[null,null,null,null,null,null,null,"Leverans",{"$f":"B269*(VLOOKUP(C270,Konsekvens,2,FALSE))","v":{"$error":"#N/A"}},{"$f":"D269*(VLOOKUP(E270,Konsekvens,2,FALSE))","v":{"$error":"#N/A"}},{"$f":"F269*(VLOOKUP(G270,Konsekvens,2,FALSE))","v":{"$error":"#N/A"}},"",null,{"$f":"N269","v":0}]
[{"$f":"'4. Oönskade händelser'!A143","v":0},null,null,null,null,null,null,"Kvalitet",{"$f":"B271*(VLOOKUP(C271,Konsekvens,2,FALSE))","v":{"$error":"#N/A"}},{"$f":"D271*(VLOOKUP(E271,Konsekvens,2,FALSE))","v":{"$error":"#N/A"}},{"$f":"F271*(VLOOKUP(G271,Konsekvens,2,FALSE))","v":{"$error":"#N/A"}},"",null,{"$f":"IF(A271=0,0,1)","v":0}]
[null,null,null,null,null,null,null,"Leverans",{"$f":"B271*(VLOOKUP(C272,Konsekvens,2,FALSE))","v":{"$error":"#N/A"}},{"$f":"D271*(VLOOKUP(E272,Konsekvens,2,FALSE))","v":{"$error":"#N/A"}},{"$f":"F271*(VLOOKUP(G272,Konsekvens,2,FALSE))","v":{"$error":"#N/A"}},"",null,{"$f":"N271","v":0}]
[{"$f":"'4. Oönskade händelser'!A144","v":0},null,null,null,null,null,null,"Kvalitet",{"$f":"B273*(VLOOKUP(C273,Konsekvens,2,FALSE))","v":{"$error":"#N/A"}},{"$f":"D273*(VLOOKUP(E273,Konsekvens,2,FALSE))","v":{"$error":"#N/A"}},{"$f":"F273*(VLOOKUP(G273,Konsekvens,2,FALSE))","v":{"$error":"#N/A"}},"",null,{"$f":"IF(A273=0,0,1)","v":0}]
[null,null,null,null,null,null,null,"Leverans",{"$f":"B273*(VLOOKUP(C274,Konsekvens,2,FALSE))","v":{"$error":"#N/A"}},{"$f":"D273*(VLOOKUP(E274,Konsekvens,2,FALSE))","v":{"$error":"#N/A"}},{"$f":"F273*(VLOOKUP(G274,Konsekvens,2,FALSE))","v":{"$error":"#N/A"}},"",null,{"$f":"N273","v":0}]
[{"$f":"'4. Oönskade händelser'!A145","v":0},null,null,null,null,null,null,"Kvalitet",{"$f":"B275*(VLOOKUP(C275,Konsekvens,2,FALSE))","v":{"$error":"#N/A"}},{"$f":"D275*(VLOOKUP(E275,Konsekvens,2,FALSE))","v":{"$error":"#N/A"}},{"$f":"F275*(VLOOKUP(G275,Konsekvens,2,FALSE))","v":{"$error":"#N/A"}},"",null,{"$f":"IF(A275=0,0,1)","v":0}]
[null,null,null,null,null,null,null,"Leverans",{"$f":"B275*(VLOOKUP(C276,Konsekvens,2,FALSE))","v":{"$error":"#N/A"}},{"$f":"D275*(VLOOKUP(E276,Konsekvens,2,FALSE))","v":{"$error":"#N/A"}},{"$f":"F275*(VLOOKUP(G276,Konsekvens,2,FALSE))","v":{"$error":"#N/A"}},"",null,{"$f":"N275","v":0}]
[{"$f":"'4. Oönskade händelser'!A146","v":0},null,null,null,null,null,null,"Kvalitet",{"$f":"B277*(VLOOKUP(C277,Konsekvens,2,FALSE))","v":{"$error":"#N/A"}},{"$f":"D277*(VLOOKUP(E277,Konsekvens,2,FALSE))","v":{"$error":"#N/A"}},{"$f":"F277*(VLOOKUP(G277,Konsekvens,2,FALSE))","v":{"$error":"#N/A"}},"",null,{"$f":"IF(A277=0,0,1)","v":0}]
[null,null,null,null,null,null,null,"Leverans",{"$f":"B277*(VLOOKUP(C278,Konsekvens,2,FALSE))","v":{"$error":"#N/A"}},{"$f":"D277*(VLOOKUP(E278,Konsekvens,2,FALSE))","v":{"$error":"#N/A"}},{"$f":"F277*(VLOOKUP(G278,Konsekvens,2,FALSE))","v":{"$error":"#N/A"}},"",null,{"$f":"N277","v":0}]
[{"$f":"'4. Oönskade händelser'!A147","v":0},null,null,null,null,null,null,"Kvalitet",{"$f":"B279*(VLOOKUP(C279,Konsekvens,2,FALSE))","v":{"$error":"#N/A"}},{"$f":"D279*(VLOOKUP(E279,Konsekvens,2,FALSE))","v":{"$error":"#N/A"}},{"$f":"F279*(VLOOKUP(G279,Konsekvens,2,FALSE))","v":{"$error":"#N/A"}},"",null,{"$f":"IF(A279=0,0,1)","v":0}]
[null,null,null,null,null,null,null,"Leverans",{"$f":"B279*(VLOOKUP(C280,Konsekvens,2,FALSE))","v":{"$error":"#N/A"}},{"$f":"D279*(VLOOKUP(E280,Konsekvens,2,FALSE))","v":{"$error":"#N/A"}},{"$f":"F279*(VLOOKUP(G280,Konsekvens,2,FALSE))","v":{"$error":"#N/A"}},"",null,{"$f":"N279","v":0}]
[{"$f":"'4. Oönskade händelser'!A148","v":0},null,null,null,null,null,null,"Kvalitet",{"$f":"B281*(VLOOKUP(C281,Konsekvens,2,FALSE))","v":{"$error":"#N/A"}},{"$f":"D281*(VLOOKUP(E281,Konsekvens,2,FALSE))","v":{"$error":"#N/A"}},{"$f":"F281*(VLOOKUP(G281,Konsekvens,2,FALSE))","v":{"$error":"#N/A"}},"",null,{"$f":"IF(A281=0,0,1)","v":0}]
[null,null,null,null,null,null,null,"Leverans",{"$f":"B281*(VLOOKUP(C282,Konsekvens,2,FALSE))","v":{"$error":"#N/A"}},{"$f":"D281*(VLOOKUP(E282,Konsekvens,2,FALSE))","v":{"$error":"#N/A"}},{"$f":"F281*(VLOOKUP(G282,Konsekvens,2,FALSE))","v":{"$error":"#N/A"}},"",null,{"$f":"N281","v":0}]
[{"$f":"'4. Oönskade händelser'!A149","v":0},null,null,null,null,null,null,"Kvalitet",{"$f":"B283*(VLOOKUP(C283,Konsekvens,2,FALSE))","v":{"$error":"#N/A"}},{"$f":"D283*(VLOOKUP(E283,Konsekvens,2,FALSE))","v":{"$error":"#N/A"}},{"$f":"F283*(VLOOKUP(G283,Konsekvens,2,FALSE))","v":{"$error":"#N/A"}},"",null,{"$f":"IF(A283=0,0,1)","v":0}]
[null,null,null,null,null,null,null,"Leverans",{"$f":"B283*(VLOOKUP(C284,Konsekvens,2,FALSE))","v":{"$error":"#N/A"}},{"$f":"D283*(VLOOKUP(E284,Konsekvens,2,FALSE))","v":{"$error":"#N/A"}},{"$f":"F283*(VLOOKUP(G284,Konsekvens,2,FALSE))","v":{"$error":"#N/A"}},"",null,{"$f":"N283","v":0}]
[{"$f":"'4. Oönskade händelser'!A150","v":0},null,null,null,null,null,null,"Kvalitet",{"$f":"B285*(VLOOKUP(C285,Konsekvens,2,FALSE))","v":{"$error":"#N/A"}},{"$f":"D285*(VLOOKUP(E285,Konsekvens,2,FALSE))","v":{"$error":"#N/A"}},{"$f":"F285*(VLOOKUP(G285,Konsekvens,2,FALSE))","v":{"$error":"#N/A"}},"",null,{"$f":"IF(A285=0,0,1)","v":0}]
[null,null,null,null,null,null,null,"Leverans",{"$f":"B285*(VLOOKUP(C286,Konsekvens,2,FALSE))","v":{"$error":"#N/A"}},{"$f":"D285*(VLOOKUP(E286,Konsekvens,2,FALSE))","v":{"$error":"#N/A"}},{"$f":"F285*(VLOOKUP(G286,Konsekvens,2,FALSE))","v":{"$error":"#N/A"}},"",null,{"$f":"N285","v":0}]
[{"$f":"'4. Oönskade händelser'!A151","v":0},null,null,null,null,null,null,"Kvalitet",{"$f":"B287*(VLOOKUP(C287,Konsekvens,2,FALSE))","v":{"$error":"#N/A"}},{"$f":"D287*(VLOOKUP(E287,Konsekvens,2,FALSE))","v":{"$error":"#N/A"}},{"$f":"F287*(VLOOKUP(G287,Konsekvens,2,FALSE))","v":{"$error":"#N/A"}},"",null,{"$f":"IF(A287=0,0,1)","v":0}]
[null,null,null,null,null,null,null,"Leverans",{"$f":"B287*(VLOOKUP(C288,Konsekvens,2,FALSE))","v":{"$error":"#N/A"}},{"$f":"D287*(VLOOKUP(E288,Konsekvens,2,FALSE))","v":{"$error":"#N/A"}},{"$f":"F287*(VLOOKUP(G288,Konsekvens,2,FALSE))","v":{"$error":"#N/A"}},"",null,{"$f":"N287","v":0}]
[{"$f":"'4. Oönskade händelser'!A152","v":0},null,null,null,null,null,null,"Kvalitet",{"$f":"B289*(VLOOKUP(C289,Konsekvens,2,FALSE))","v":{"$error":"#N/A"}},{"$f":"D289*(VLOOKUP(E289,Konsekvens,2,FALSE))","v":{"$error":"#N/A"}},{"$f":"F289*(VLOOKUP(G289,Konsekvens,2,FALSE))","v":{"$error":"#N/A"}},"",null,{"$f":"IF(A289=0,0,1)","v":0}]
[null,null,null,null,null,null,null,"Leverans",{"$f":"B289*(VLOOKUP(C290,Konsekvens,2,FALSE))","v":{"$error":"#N/A"}},{"$f":"D289*(VLOOKUP(E290,Konsekvens,2,FALSE))","v":{"$error":"#N/A"}},{"$f":"F289*(VLOOKUP(G290,Konsekvens,2,FALSE))","v":{"$error":"#N/A"}},"",null,{"$f":"N289","v":0}]
[{"$f":"'4. Oönskade händelser'!A153","v":0},null,null,null,null,null,null,"Kvalitet",{"$f":"B291*(VLOOKUP(C291,Konsekvens,2,FALSE))","v":{"$error":"#N/A"}},{"$f":"D291*(VLOOKUP(E291,Konsekvens,2,FALSE))","v":{"$error":"#N/A"}},{"$f":"F291*(VLOOKUP(G291,Konsekvens,2,FALSE))","v":{"$error":"#N/A"}},"",null,{"$f":"IF(A291=0,0,1)","v":0}]
[null,null,null,null,null,null,null,"Leverans",{"$f":"B291*(VLOOKUP(C292,Konsekvens,2,FALSE))","v":{"$error":"#N/A"}},{"$f":"D291*(VLOOKUP(E292,Konsekvens,2,FALSE))","v":{"$error":"#N/A"}},{"$f":"F291*(VLOOKUP(G292,Konsekvens,2,FALSE))","v":{"$error":"#N/A"}},"",null,{"$f":"N291","v":0}]
[{"$f":"'4. Oönskade händelser'!A154","v":0},null,null,null,null,null,null,"Kvalitet",{"$f":"B293*(VLOOKUP(C293,Konsekvens,2,FALSE))","v":{"$error":"#N/A"}},{"$f":"D293*(VLOOKUP(E293,Konsekvens,2,FALSE))","v":{"$error":"#N/A"}},{"$f":"F293*(VLOOKUP(G293,Konsekvens,2,FALSE))","v":{"$error":"#N/A"}},"",null,{"$f":"IF(A293=0,0,1)","v":0}]
[null,null,null,null,null,null,null,"Leverans",{"$f":"B293*(VLOOKUP(C294,Konsekvens,2,FALSE))","v":{"$error":"#N/A"}},{"$f":"D293*(VLOOKUP(E294,Konsekvens,2,FALSE))","v":{"$error":"#N/A"}},{"$f":"F293*(VLOOKUP(G294,Konsekvens,2,FALSE))","v":{"$error":"#N/A"}},"",null,{"$f":"N293","v":0}]
[{"$f":"'4. Oönskade händelser'!A155","v":0},null,null,null,null,null,null,"Kvalitet",{"$f":"B295*(VLOOKUP(C295,Konsekvens,2,FALSE))","v":{"$error":"#N/A"}},{"$f":"D295*(VLOOKUP(E295,Konsekvens,2,FALSE))","v":{"$error":"#N/A"}},{"$f":"F295*(VLOOKUP(G295,Konsekvens,2,FALSE))","v":{"$error":"#N/A"}},"",null,{"$f":"IF(A295=0,0,1)","v":0}]
[null,null,null,null,null,null,null,"Leverans",{"$f":"B295*(VLOOKUP(C296,Konsekvens,2,FALSE))","v":{"$error":"#N/A"}},{"$f":"D295*(VLOOKUP(E296,Konsekvens,2,FALSE))","v":{"$error":"#N/A"}},{"$f":"F295*(VLOOKUP(G296,Konsekvens,2,FALSE))","v":{"$error":"#N/A"}},"",null,{"$f":"N295","v":0}]

{"sheet":"6. Åtgärdsanalys","index":6,"n_rows":302,"n_cols":18,"rows_kept":302,"cut":false,"hidden":false,"merged":[[286,0,287,0],[288,0,289,0],[290,0,291,0],[292,0,293,0],[294,0,295,0],[296,0,297,0],[298,0,299,0],[300,0,301,0],[268,0,269,0],[270,0,271,0],[272,0,273,0],[274,0,275,0],[276,0,277,0],[278,0,279,0],[280,0,281,0],[282,0,283,0],[284,0,285,0],[250,0,251,0],[252,0,253,0],[254,0,255,0],[256,0,257,0],[258,0,259,0],[260,0,261,0],[262,0,263,0],[264,0,265,0],[266,0,267,0],[232,0,233,0],[234,0,235,0],[236,0,237,0],[238,0,239,0],[240,0,241,0],[242,0,243,0],[244,0,245,0],[246,0,247,0],[248,0,249,0],[214,0,215,0],[216,0,217,0],[218,0,219,0],[220,0,221,0],[222,0,223,0],[224,0,225,0],[226,0,227,0],[228,0,229,0],[230,0,231,0],[196,0,197,0],[198,0,199,0],[200,0,201,0],[202,0,203,0],[204,0,205,0],[206,0,207,0],[208,0,209,0],[210,0,211,0],[212,0,213,0],[178,0,179,0],[180,0,181,0],[182,0,183,0],[184,0,185,0],[186,0,187,0],[188,0,189,0],[190,0,191,0],[192,0,193,0],[194,0,195,0],[160,0,161,0],[162,0,163,0],[164,0,165,0],[166,0,167,0],[168,0,169,0],[170,0,171,0],[172,0,173,0],[174,0,175,0],[176,0,177,0],[7,0,8,0],[7,1,8,1],[7,2,8,2],[7,3,8,3],[7,4,8,4],[7,6,8,6],[7,8,8,8],[9,8,10,8],[11,0,12,0],[11,1,12,1],[11,2,12,2],[11,3,12,3],[11,4,12,4],[11,6,12,6],[11,8,12,8],[9,0,10,0],[9,1,10,1],[9,2,10,2],[9,3,10,3],[9,4,10,4],[9,6,10,6],[13,8,14,8],[15,0,16,0],[15,1,16,1],[15,2,16,2],[15,3,16,3],[15,4,16,4],[15,6,16,6],[15,8,16,8],[13,0,14,0],[13,1,14,1],[13,2,14,2],[13,3,14,3],[13,4,14,4],[13,6,14,6],[17,8,18,8],[19,0,20,0],[19,1,20,1],[19,2,20,2],[19,3,20,3],[19,4,20,4],[19,6,20,6],[19,8,20,8],[17,0,18,0],[17,1,18,1],[17,2,18,2],[17,3,18,3],[17,4,18,4],[17,6,18,6],[21,8,22,8],[23,0,24,0],[23,1,24,1],[23,2,24,2],[23,3,24,3],[23,4,24,4],[23,6,24,6],[23,8,24,8],[21,0,22,0],[21,1,22,1],[21,2,22,2],[21,3,22,3],[21,4,22,4],[21,6,22,6],[25,8,26,8],[27,0,28,0],[27,1,28,1],[27,2,28,2],[27,3,28,3],[27,4,28,4],[27,6,28,6],[27,8,28,8],[25,0,26,0],[25,1,26,1],[25,2,26,2],[25,3,26,3],[25,4,26,4],[25,6,26,6],[29,8,30,8],[31,0,32,0],[31,1,32,1],[31,2,32,2],[31,3,32,3],[31,4,32,4],[31,6,32,6],[31,8,32,8],[29,0,30,0],[29,1,30,1],[29,2,30,2],[29,3,30,3],[29,4,30,4],[29,6,30,6],[39,8,40,8],[37,0,38,0],[37,1,38,1],[37,2,38,2],[37,3,38,3],[37,4,38,4],[37,6,38,6],[33,8,34,8],[35,0,36,0],[35,1,36,1],[35,2,36,2],[35,3,36,3],[35,4,36,4],[35,6,36,6],[35,8,36,8],[33,0,34,0],[33,1,34,1],[33,2,34,2],[33,3,34,3],[33,4,34,4],[33,6,34,6],[5,0,5,3],[5,4,5,9],[5,10,5,13],[41,8,42,8],[43,0,44,0],[43,1,44,1],[43,2,44,2],[43,3,44,3],[43,4,44,4],[43,6,44,6],[43,8,44,8],[41,0,42,0],[41,1,42,1],[41,2,42,2],[41,3,42,3],[41,4,42,4],[41,6,42,6],[37,8,38,8],[39,0,40,0],[39,1,40,1],[39,2,40,2],[39,3,40,3],[39,4,40,4],[39,6,40,6],[45,0,46,0],[45,1,46,1],[45,2,46,2],[45,3,46,3],[45,4,46,4],[45,6,46,6],[45,8,46,8],[47,0,48,0],[47,1,48,1],[47,2,48,2],[47,3,48,3],[47,4,48,4],[47,6,48,6],[47,8,48,8],[49,0,50,0],[49,1,50,1],[49,2,50,2],[49,3,50,3],[49,4,50,4],[49,6,50,6],[49,8,50,8],[51,0,52,0],[51,1,52,1],[51,2,52,2],[51,3,52,3],[51,4,52,4],[51,6,52,6],[51,8,52,8],[53,0,54,0],[53,1,54,1],[53,2,54,2],[53,3,54,3],[53,4,54,4],[53,6,54,6],[53,8,54,8],[55,0,56,0],[55,1,56,1],[55,2,56,2],[55,3,56,3],[55,4,56,4],[55,6,56,6],[55,8,56,8],[57,0,58,0],[57,1,58,1],[57,2,58,2],[57,3,58,3],[57,4,58,4],[57,6,58,6],[57,8,58,8],[59,0,60,0],[59,1,60,1],[59,2,60,2],[59,3,60,3],[59,4,60,4],[59,6,60,6],[59,8,60,8],[61,0,62,0],[61,1,62,1],[61,2,62,2],[61,3,62,3],[61,4,62,4],[61,6,62,6],[61,8,62,8],[63,0,64,0],[63,1,64,1],[63,2,64,2],[63,3,64,3],[63,4,64,4],[63,6,64,6],[63,8,64,8],[65,0,66,0],[65,1,66,1],[65,2,66,2],[65,3,66,3],[65,4,66,4],[65,6,66,6],[65,8,66,8],[67,0,68,0],[67,1,68,1],[67,2,68,2],[67,3,68,3],[67,4,68,4],[67,6,68,6],[67,8,68,8],[69,0,70,0],[69,1,70,1],[69,2,70,2],[69,3,70,3],[69,4,70,4],[69,6,70,6],[69,8,70,8],[71,0,72,0],[71,1,72,1],[71,2,72,2],[71,3,72,3],[71,4,72,4],[71,6,72,6],[71,8,72,8],[73,0,74,0],[73,1,74,1],[73,2,74,2],[73,3,74,3],[73,4,74,4],[73,6,74,6],[73,8,74,8],[75,0,76,0],[75,1,76,1],[75,2,76,2],[75,3,76,3],[75,4,76,4],[75,6,76,6],[75,8,76,8],[77,0,78,0],[77,1,78,1],[77,2,78,2],[77,3,78,3],[77,4,78,4],[77,6,78,6],[77,8,78,8],[79,0,80,0],[79,1,80,1],[79,2,80,2],[79,3,80,3],[79,4,80,4],[79,6,80,6],[79,8,80,8],[81,0,82,0],[81,1,82,1],[81,2,82,2],[81,3,82,3],[81,4,82,4],[81,6,82,6],[81,8,82,8],[83,0,84,0],[83,1,84,1],[83,2,84,2],[83,3,84,3],[83,4,84,4],[83,6,84,6],[83,8,84,8],[85,0,86,0],[85,1,86,1],[85,2,86,2],[85,3,86,3],[85,4,86,4],[85,6,86,6],[85,8,86,8],[87,0,88,0],[87,1,88,1],[87,2,88,2],[87,3,88,3],[87,4,88,4],[87,6,88,6],[87,8,88,8],[89,0,90,0],[89,1,90,1],[89,2,90,2],[89,3,90,3],[89,4,90,4],[89,6,90,6],[89,8,90,8],[91,0,92,0],[91,1,92,1],[91,2,92,2],[91,3,92,3],[91,4,92,4],[91,6,92,6],[91,8,92,8],[93,0,94,0],[93,1,94,1],[93,2,94,2],[93,3,94,3],[93,4,94,4],[93,6,94,6],[93,8,94,8],[95,0,96,0],[95,1,96,1],[95,2,96,2],[95,3,96,3],[95,4,96,4],[95,6,96,6],[95,8,96,8],[97,0,98,0],[97,1,98,1],[97,2,98,2],[97,3,98,3],[97,4,98,4],[97,6,98,6],[97,8,98,8],[99,0,100,0],[99,1,100,1],[99,2,100,2],[99,3,100,3],[99,4,100,4],[99,6,100,6],[99,8,100,8],[101,0,102,0],[101,1,102,1],[101,2,102,2],[101,3,102,3],[101,4,102,4],[101,6,102,6],[101,8,102,8],[103,0,104,0],[103,1,104,1],[103,2,104,2],[103,3,104,3],[103,4,104,4],[103,6,104,6],[103,8,104,8],[105,0,106,0],[105,1,106,1],[105,2,106,2],[105,3,106,3],[105,4,106,4],[105,6,106,6],[105,8,106,8],[107,0,108,0],[107,1,108,1],[107,2,108,2],[107,3,108,3],[107,4,108,4],[107,6,108,6],[107,8,108,8],[109,0,110,0],[109,1,110,1],[109,2,110,2],[109,3,110,3],[109,4,110,4],[109,6,110,6],[109,8,110,8],[111,0,112,0],[111,1,112,1],[111,2,112,2],[111,3,112,3],[111,4,112,4],[111,6,112,6],[111,8,112,8],[113,0,114,0],[113,1,114,1],[113,2,114,2],[113,3,114,3],[113,4,114,4],[113,6,114,6],[113,8,114,8],[115,0,116,0],[115,1,116,1],[115,2,116,2],[115,3,116,3],[115,4,116,4],[115,6,116,6],[115,8,116,8],[117,0,118,0],[117,1,118,1],[117,2,118,2],[117,3,118,3],[117,4,118,4],[117,6,118,6],[117,8,118,8],[119,0,120,0],[119,1,120,1],[119,2,120,2],[119,3,120,3],[119,4,120,4],[119,6,120,6],[119,8,120,8],[121,0,122,0],[121,1,122,1],[121,2,122,2],[121,3,122,3],[121,4,122,4],[121,6,122,6],[121,8,122,8],[123,0,124,0],[123,1,124,1],[123,2,124,2],[123,3,124,3],[123,4,124,4],[123,6,124,6],[123,8,124,8],[125,0,126,0],[125,1,126,1],[125,2,126,2],[125,3,126,3],[125,4,126,4],[125,6,126,6],[125,8,126,8],[127,0,128,0],[127,1,128,1],[127,2,128,2],[127,3,128,3],[127,4,128,4],[127,6,128,6],[127,8,128,8],[129,0,130,0],[129,1,130,1],[129,2,130,2],[129,3,130,3],[129,4,130,4],[129,6,130,6],[129,8,130,8],[131,0,132,0],[131,1,132,1],[131,2,132,2],[131,3,132,3],[131,4,132,4],[131,6,132,6],[131,8,132,8],[133,0,134,0],[133,1,134,1],[133,2,134,2],[133,3,134,3],[133,4,134,4],[133,6,134,6],[133,8,134,8],[135,0,136,0],[135,1,136,1],[135,2,136,2],[135,3,136,3],[135,4,136,4],[135,6,136,6],[135,8,136,8],[137,0,138,0],[137,1,138,1],[137,2,138,2],[137,3,138,3],[137,4,138,4],[137,6,138,6],[137,8,138,8],[139,0,140,0],[139,1,140,1],[139,2,140,2],[139,3,140,3],[139,4,140,4],[139,6,140,6],[139,8,140,8],[141,0,142,0],[141,1,142,1],[141,2,142,2],[141,3,142,3],[141,4,142,4],[141,6,142,6],[141,8,142,8],[143,0,144,0],[143,1,144,1],[143,2,144,2],[143,3,144,3],[143,4,144,4],[143,6,144,6],[143,8,144,8],[145,0,146,0],[145,1,146,1],[145,2,146,2],[145,3,146,3],[145,4,146,4],[145,6,146,6],[145,8,146,8],[147,0,148,0],[147,1,148,1],[147,2,148,2],[147,3,148,3],[147,4,148,4],[147,6,148,6],[147,8,148,8],[156,0,157,0],[158,0,159,0],[149,0,150,0],[149,1,150,1],[149,2,150,2],[149,3,150,3],[149,4,150,4],[149,6,150,6],[149,8,150,8],[151,0,152,0],[153,0,154,0]]}
["Åtgärdsanalys",null,null,null,null,null,null,null,null,null,{"$f":"Startsida!C6","v":"Grusstad"}]
[]
[]
[]
[]
["Riskanalys",null,null,null,"Sannolikhet (S) och konsekvens (K)",null,null,null,null,null,"Risk"]
["Oönskade händelser systemanalys","Nuläge"," om 20 år"," om 50 år","S","K","S","K","S","K","Faktor","Idag","20 år","70 år","Åtgärdas","Målfunktion","Åtgärder","Kommentarer"]
[{"$f":"'5. Riskanalys'!A8:A9","v":"Vattenbrist under perioder med stora vattenutttag, vilket ofta sammanfaller med perioder med låga grundvattennivåer (sommaren)."},{"$f":"'5. Riskanalys'!#REF!","v":{"$error":"#REF!"}},{"$f":"'5. Riskanalys'!#REF!","v":{"$error":"#REF!"}},{"$f":"'5. Riskanalys'!#REF!","v":{"$error":"#REF!"}},{"$f":"'5. Riskanalys'!B8:B9","v":3},{"$f":"'5. Riskanalys'!C8","v":2},{"$f":"'5. Riskanalys'!D8:D9","v":3},{"$f":"'5. Riskanalys'!E8","v":2},{"$f":"'5. Riskanalys'!F8:F9","v":4},{"$f":"'5. Riskanalys'!G8","v":2},{"$f":"'5. Riskanalys'!H8","v":"Kvalitet"},{"$f":"'5. Riskanalys'!I8","v":15},{"$f":"'5. Riskanalys'!J8","v":15},{"$f":"'5. Riskanalys'!K8","v":20},{"$f":"IF('5. Riskanalys'!L8=\"x\",\"x\",IF('5. Riskanalys'!M8<>\"\",\"x\",\"\"))","v":"x"},"Att klara en förbrukning på 4000 m3/dygn under kortare perioder (ca 2 månader).","Anlägga en ny vattentäkt alternativt borra fler/djupare brunnar i ett nytt område."]
[null,null,null,null,null,{"$f":"'5. Riskanalys'!C9","v":2},null,{"$f":"'5. Riskanalys'!E9","v":2},null,{"$f":"'5. Riskanalys'!G9","v":2},{"$f":"'5. Riskanalys'!H9","v":"Leverans"},{"$f":"'5. Riskanalys'!I9","v":15},{"$f":"'5. Riskanalys'!J9","v":15},{"$f":"'5. Riskanalys'!K9","v":20},{"$f":"IF('5. Riskanalys'!L9=\"x\",\"x\",IF('5. Riskanalys'!M9<>\"\",\"x\",\"\"))","v":"x"}]
[{"$f":"'5. Riskanalys'!A10:A11","v":"Eftersom tillstånd inte finns föreligger risk att andra verksamheter, exempelvis jordbruk, ökar uttag och därmed ger sänkta vattennivåer som kan leda till vattenbrist."},{"$f":"'5. Riskanalys'!#REF!","v":{"$error":"#REF!"}},{"$f":"'5. Riskanalys'!#REF!","v":{"$error":"#REF!"}},{"$f":"'5. Riskanalys'!#REF!","v":{"$error":"#REF!"}},{"$f":"'5. Riskanalys'!B10:B11","v":1},{"$f":"'5. Riskanalys'!C10","v":2},{"$f":"'5. Riskanalys'!D10:D11","v":2},{"$f":"'5. Riskanalys'!E10","v":2},{"$f":"'5. Riskanalys'!F10:F11","v":2},{"$f":"'5. Riskanalys'!G10","v":2},{"$f":"'5. Riskanalys'!H10","v":"Kvalitet"},{"$f":"'5. Riskanalys'!I10","v":5},{"$f":"'5. Riskanalys'!J10","v":10},{"$f":"'5. Riskanalys'!K10","v":10},{"$f":"IF('5. Riskanalys'!L10=\"x\",\"x\",IF('5. Riskanalys'!M10<>\"\",\"x\",\"\"))","v":""}]
[null,null,null,null,null,{"$f":"'5. Riskanalys'!C11","v":1},null,{"$f":"'5. Riskanalys'!E11","v":1},null,{"$f":"'5. Riskanalys'!G11","v":1},{"$f":"'5. Riskanalys'!H11","v":"Leverans"},{"$f":"'5. Riskanalys'!I11","v":1},{"$f":"'5. Riskanalys'!J11","v":2},{"$f":"'5. Riskanalys'!K11","v":2},{"$f":"IF('5. Riskanalys'!L11=\"x\",\"x\",IF('5. Riskanalys'!M11<>\"\",\"x\",\"\"))","v":""}]
[{"$f":"'5. Riskanalys'!A12:A13","v":0},{"$f":"'5. Riskanalys'!#REF!","v":{"$error":"#REF!"}},{"$f":"'5. Riskanalys'!#REF!","v":{"$error":"#REF!"}},{"$f":"'5. Riskanalys'!#REF!","v":{"$error":"#REF!"}},{"$f":"'5. Riskanalys'!B12:B13","v":0},{"$f":"'5. Riskanalys'!C12","v":0},{"$f":"'5. Riskanalys'!D12:D13","v":0},{"$f":"'5. Riskanalys'!E12","v":0},{"$f":"'5. Riskanalys'!F12:F13","v":0},{"$f":"'5. Riskanalys'!G12","v":0},{"$f":"'5. Riskanalys'!H12","v":"Kvalitet"},{"$f":"'5. Riskanalys'!I12","v":{"$error":"#N/A"}},{"$f":"'5. Riskanalys'!J12","v":{"$error":"#N/A"}},{"$f":"'5. Riskanalys'!K12","v":{"$error":"#N/A"}},{"$f":"IF('5. Riskanalys'!L12=\"x\",\"x\",IF('5. Riskanalys'!M12<>\"\",\"x\",\"\"))","v":""}]
[null,null,null,null,null,{"$f":"'5. Riskanalys'!C13","v":0},null,{"$f":"'5. Riskanalys'!E13","v":0},null,{"$f":"'5. Riskanalys'!G13","v":0},{"$f":"'5. Riskanalys'!H13","v":"Leverans"},{"$f":"'5. Riskanalys'!I13","v":{"$error":"#N/A"}},{"$f":"'5. Riskanalys'!J13","v":{"$error":"#N/A"}},{"$f":"'5. Riskanalys'!K13","v":{"$error":"#N/A"}},{"$f":"IF('5. Riskanalys'!L13=\"x\",\"x\",IF('5. Riskanalys'!M13<>\"\",\"x\",\"\"))","v":""}]
[{"$f":"'5. Riskanalys'!A14:A15","v":0},{"$f":"'5. Riskanalys'!#REF!","v":{"$error":"#REF!"}},{"$f":"'5. Riskanalys'!#REF!","v":{"$error":"#REF!"}},{"$f":"'5. Riskanalys'!#REF!","v":{"$error":"#REF!"}},{"$f":"'5. Riskanalys'!B14:B15","v":0},{"$f":"'5. Riskanalys'!C14","v":0},{"$f":"'5. Riskanalys'!D14:D15","v":0},{"$f":"'5. Riskanalys'!E14","v":0},{"$f":"'5. Riskanalys'!F14:F15","v":0},{"$f":"'5. Riskanalys'!G14","v":0},{"$f":"'5. Riskanalys'!H14","v":"Kvalitet"},{"$f":"'5. Riskanalys'!I14","v":{"$error":"#N/A"}},{"$f":"'5. Riskanalys'!J14","v":{"$error":"#N/A"}},{"$f":"'5. Riskanalys'!K14","v":{"$error":"#N/A"}},{"$f":"IF('5. Riskanalys'!L14=\"x\",\"x\",IF('5. Riskanalys'!M14<>\"\",\"x\",\"\"))","v":""}]
[null,null,null,null,null,{"$f":"'5. Riskanalys'!C15","v":0},null,{"$f":"'5. Riskanalys'!E15","v":0},null,{"$f":"'5. Riskanalys'!G15","v":0},{"$f":"'5. Riskanalys'!H15","v":"Leverans"},{"$f":"'5. Riskanalys'!I15","v":{"$error":"#N/A"}},{"$f":"'5. Riskanalys'!J15","v":{"$error":"#N/A"}},{"$f":"'5. Riskanalys'!K15","v":{"$error":"#N/A"}},{"$f":"IF('5. Riskanalys'!L15=\"x\",\"x\",IF('5. Riskanalys'!M15<>\"\",\"x\",\"\"))","v":""}]
[{"$f":"'5. Riskanalys'!A16:A17","v":0},{"$f":"'5. Riskanalys'!#REF!","v":{"$error":"#REF!"}},{"$f":"'5. Riskanalys'!#REF!","v":{"$error":"#REF!"}},{"$f":"'5. Riskanalys'!#REF!","v":{"$error":"#REF!"}},{"$f":"'5. Riskanalys'!B16:B17","v":0},{"$f":"'5. Riskanalys'!C16","v":0},{"$f":"'5. Riskanalys'!D16:D17","v":0},{"$f":"'5. Riskanalys'!E16","v":0},{"$f":"'5. Riskanalys'!F16:F17","v":0},{"$f":"'5. Riskanalys'!G16","v":0},{"$f":"'5. Riskanalys'!H16","v":"Kvalitet"},{"$f":"'5. Riskanalys'!I16","v":{"$error":"#N/A"}},{"$f":"'5. Riskanalys'!J16","v":{"$error":"#N/A"}},{"$f":"'5. Riskanalys'!K16","v":{"$error":"#N/A"}},{"$f":"IF('5. Riskanalys'!L16=\"x\",\"x\",IF('5. Riskanalys'!M16<>\"\",\"x\",\"\"))","v":""}]
[null,null,null,null,null,{"$f":"'5. Riskanalys'!C17","v":0},null,{"$f":"'5. Riskanalys'!E17","v":0},null,{"$f":"'5. Riskanalys'!G17","v":0},{"$f":"'5. Riskanalys'!H17","v":"Leverans"},{"$f":"'5. Riskanalys'!I17","v":{"$error":"#N/A"}},{"$f":"'5. Riskanalys'!J17","v":{"$error":"#N/A"}},{"$f":"'5. Riskanalys'!K17","v":{"$error":"#N/A"}},{"$f":"IF('5. Riskanalys'!L17=\"x\",\"x\",IF('5. Riskanalys'!M17<>\"\",\"x\",\"\"))","v":""}]
[{"$f":"'5. Riskanalys'!A18:A19","v":0},{"$f":"'5. Riskanalys'!#REF!","v":{"$error":"#REF!"}},{"$f":"'5. Riskanalys'!#REF!","v":{"$error":"#REF!"}},{"$f":"'5. Riskanalys'!#REF!","v":{"$error":"#REF!"}},{"$f":"'5. Riskanalys'!B18:B19","v":0},{"$f":"'5. Riskanalys'!C18","v":0},{"$f":"'5. Riskanalys'!D18:D19","v":0},{"$f":"'5. Riskanalys'!E18","v":0},{"$f":"'5. Riskanalys'!F18:F19","v":0},{"$f":"'5. Riskanalys'!G18","v":0},{"$f":"'5. Riskanalys'!H18","v":"Kvalitet"},{"$f":"'5. Riskanalys'!I18","v":{"$error":"#N/A"}},{"$f":"'5. Riskanalys'!J18","v":{"$error":"#N/A"}},{"$f":"'5. Riskanalys'!K18","v":{"$error":"#N/A"}},{"$f":"IF('5. Riskanalys'!L18=\"x\",\"x\",IF('5. Riskanalys'!M18<>\"\",\"x\",\"\"))","v":""}]
[null,null,null,null,null,{"$f":"'5. Riskanalys'!C19","v":0},null,{"$f":"'5. Riskanalys'!E19","v":0},null,{"$f":"'5. Riskanalys'!G19","v":0},{"$f":"'5. Riskanalys'!H19","v":"Leverans"},{"$f":"'5. Riskanalys'!I19","v":{"$error":"#N/A"}},{"$f":"'5. Riskanalys'!J19","v":{"$error":"#N/A"}},{"$f":"'5. Riskanalys'!K19","v":{"$error":"#N/A"}},{"$f":"IF('5. Riskanalys'!L19=\"x\",\"x\",IF('5. Riskanalys'!M19<>\"\",\"x\",\"\"))","v":""}]
[{"$f":"'5. Riskanalys'!A20:A21","v":0},{"$f":"'5. Riskanalys'!#REF!","v":{"$error":"#REF!"}},{"$f":"'5. Riskanalys'!#REF!","v":{"$error":"#REF!"}},{"$f":"'5. Riskanalys'!#REF!","v":{"$error":"#REF!"}},{"$f":"'5. Riskanalys'!B20:B21","v":0},{"$f":"'5. Riskanalys'!C20","v":0},{"$f":"'5. Riskanalys'!D20:D21","v":0},{"$f":"'5. Riskanalys'!E20","v":0},{"$f":"'5. Riskanalys'!F20:F21","v":0},{"$f":"'5. Riskanalys'!G20","v":0},{"$f":"'5. Riskanalys'!H20","v":"Kvalitet"},{"$f":"'5. Riskanalys'!I20","v":{"$error":"#N/A"}},{"$f":"'5. Riskanalys'!J20","v":{"$error":"#N/A"}},{"$f":"'5. Riskanalys'!K20","v":{"$error":"#N/A"}},{"$f":"IF('5. Riskanalys'!L20=\"x\",\"x\",IF('5. Riskanalys'!M20<>\"\",\"x\",\"\"))","v":""}]
[null,null,null,null,null,{"$f":"'5. Riskanalys'!C21","v":0},null,{"$f":"'5. Riskanalys'!E21","v":0},null,{"$f":"'5. Riskanalys'!G21","v":0},{"$f":"'5. Riskanalys'!H21","v":"Leverans"},{"$f":"'5. Riskanalys'!I21","v":{"$error":"#N/A"}},{"$f":"'5. Riskanalys'!J21","v":{"$error":"#N/A"}},{"$f":"'5. Riskanalys'!K21","v":{"$error":"#N/A"}},{"$f":"IF('5. Riskanalys'!L21=\"x\",\"x\",IF('5. Riskanalys'!M21<>\"\",\"x\",\"\"))","v":""}]
[{"$f":"'5. Riskanalys'!A22:A23","v":0},{"$f":"'5. Riskanalys'!#REF!","v":{"$error":"#REF!"}},{"$f":"'5. Riskanalys'!#REF!","v":{"$error":"#REF!"}},{"$f":"'5. Riskanalys'!#REF!","v":{"$error":"#REF!"}},{"$f":"'5. Riskanalys'!B22:B23","v":0},{"$f":"'5. Riskanalys'!C22","v":0},{"$f":"'5. Riskanalys'!D22:D23","v":0},{"$f":"'5. Riskanalys'!E22","v":0},{"$f":"'5. Riskanalys'!F22:F23","v":0},{"$f":"'5. Riskanalys'!G22","v":0},{"$f":"'5. Riskanalys'!H22","v":"Kvalitet"},{"$f":"'5. Riskanalys'!I22","v":{"$error":"#N/A"}},{"$f":"'5. Riskanalys'!J22","v":{"$error":"#N/A"}},{"$f":"'5. Riskanalys'!K22","v":{"$error":"#N/A"}},{"$f":"IF('5. Riskanalys'!L22=\"x\",\"x\",IF('5. Riskanalys'!M22<>\"\",\"x\",\"\"))","v":""}]
[null,null,null,null,null,{"$f":"'5. Riskanalys'!C23","v":0},null,{"$f":"'5. Riskanalys'!E23","v":0},null,{"$f":"'5. Riskanalys'!G23","v":0},{"$f":"'5. Riskanalys'!H23","v":"Leverans"},{"$f":"'5. Riskanalys'!I23","v":{"$error":"#N/A"}},{"$f":"'5. Riskanalys'!J23","v":{"$error":"#N/A"}},{"$f":"'5. Riskanalys'!K23","v":{"$error":"#N/A"}},{"$f":"IF('5. Riskanalys'!L23=\"x\",\"x\",IF('5. Riskanalys'!M23<>\"\",\"x\",\"\"))","v":""}]
[{"$f":"'5. Riskanalys'!A24:A25","v":0},{"$f":"'5. Riskanalys'!#REF!","v":{"$error":"#REF!"}},{"$f":"'5. Riskanalys'!#REF!","v":{"$error":"#REF!"}},{"$f":"'5. Riskanalys'!#REF!","v":{"$error":"#REF!"}},{"$f":"'5. Riskanalys'!B24:B25","v":0},{"$f":"'5. Riskanalys'!C24","v":0},{"$f":"'5. Riskanalys'!D24:D25","v":0},{"$f":"'5. Riskanalys'!E24","v":0},{"$f":"'5. Riskanalys'!F24:F25","v":0},{"$f":"'5. Riskanalys'!G24","v":0},{"$f":"'5. Riskanalys'!H24","v":"Kvalitet"},{"$f":"'5. Riskanalys'!I24","v":{"$error":"#N/A"}},{"$f":"'5. Riskanalys'!J24","v":{"$error":"#N/A"}},{"$f":"'5. Riskanalys'!K24","v":{"$error":"#N/A"}},{"$f":"IF('5. Riskanalys'!L24=\"x\",\"x\",IF('5. Riskanalys'!M24<>\"\",\"x\",\"\"))","v":""}]
[null,null,null,null,null,{"$f":"'5. Riskanalys'!C25","v":0},null,{"$f":"'5. Riskanalys'!E25","v":0},null,{"$f":"'5. Riskanalys'!G25","v":0},{"$f":"'5. Riskanalys'!H25","v":"Leverans"},{"$f":"'5. Riskanalys'!I25","v":{"$error":"#N/A"}},{"$f":"'5. Riskanalys'!J25","v":{"$error":"#N/A"}},{"$f":"'5. Riskanalys'!K25","v":{"$error":"#N/A"}},{"$f":"IF('5. Riskanalys'!L25=\"x\",\"x\",IF('5. Riskanalys'!M25<>\"\",\"x\",\"\"))","v":""}]
[{"$f":"'5. Riskanalys'!A26:A27","v":0},{"$f":"'5. Riskanalys'!#REF!","v":{"$error":"#REF!"}},{"$f":"'5. Riskanalys'!#REF!","v":{"$error":"#REF!"}},{"$f":"'5. Riskanalys'!#REF!","v":{"$error":"#REF!"}},{"$f":"'5. Riskanalys'!B26:B27","v":0},{"$f":"'5. Riskanalys'!C26","v":0},{"$f":"'5. Riskanalys'!D26:D27","v":0},{"$f":"'5. Riskanalys'!E26","v":0},{"$f":"'5. Riskanalys'!F26:F27","v":0},{"$f":"'5. Riskanalys'!G26","v":0},{"$f":"'5. Riskanalys'!H26","v":"Kvalitet"},{"$f":"'5. Riskanalys'!I26","v":{"$error":"#N/A"}},{"$f":"'5. Riskanalys'!J26","v":{"$error":"#N/A"}},{"$f":"'5. Riskanalys'!K26","v":{"$error":"#N/A"}},{"$f":"IF('5. Riskanalys'!L26=\"x\",\"x\",IF('5. Riskanalys'!M26<>\"\",\"x\",\"\"))","v":""}]
[null,null,null,null,null,{"$f":"'5. Riskanalys'!C27","v":0},null,{"$f":"'5. Riskanalys'!E27","v":0},null,{"$f":"'5. Riskanalys'!G27","v":0},{"$f":"'5. Riskanalys'!H27","v":"Leverans"},{"$f":"'5. Riskanalys'!I27","v":{"$error":"#N/A"}},{"$f":"'5. Riskanalys'!J27","v":{"$error":"#N/A"}},{"$f":"'5. Riskanalys'!K27","v":{"$error":"#N/A"}},{"$f":"IF('5. Riskanalys'!L27=\"x\",\"x\",IF('5. Riskanalys'!M27<>\"\",\"x\",\"\"))","v":""}]
[{"$f":"'5. Riskanalys'!A28:A29","v":0},{"$f":"'5. Riskanalys'!#REF!","v":{"$error":"#REF!"}},{"$f":"'5. Riskanalys'!#REF!","v":{"$error":"#REF!"}},{"$f":"'5. Riskanalys'!#REF!","v":{"$error":"#REF!"}},{"$f":"'5. Riskanalys'!B28:B29","v":0},{"$f":"'5. Riskanalys'!C28","v":0},{"$f":"'5. Riskanalys'!D28:D29","v":0},{"$f":"'5. Riskanalys'!E28","v":0},{"$f":"'5. Riskanalys'!F28:F29","v":0},{"$f":"'5. Riskanalys'!G28","v":0},{"$f":"'5. Riskanalys'!H28","v":"Kvalitet"},{"$f":"'5. Riskanalys'!I28","v":{"$error":"#N/A"}},{"$f":"'5. Riskanalys'!J28","v":{"$error":"#N/A"}},{"$f":"'5. Riskanalys'!K28","v":{"$error":"#N/A"}},{"$f":"IF('5. Riskanalys'!L28=\"x\",\"x\",IF('5. Riskanalys'!M28<>\"\",\"x\",\"\"))","v":""}]
[null,null,null,null,null,{"$f":"'5. Riskanalys'!C29","v":0},null,{"$f":"'5. Riskanalys'!E29","v":0},null,{"$f":"'5. Riskanalys'!G29","v":0},{"$f":"'5. Riskanalys'!H29","v":"Leverans"},{"$f":"'5. Riskanalys'!I29","v":{"$error":"#N/A"}},{"$f":"'5. Riskanalys'!J29","v":{"$error":"#N/A"}},{"$f":"'5. Riskanalys'!K29","v":{"$error":"#N/A"}},{"$f":"IF('5. Riskanalys'!L29=\"x\",\"x\",IF('5. Riskanalys'!M29<>\"\",\"x\",\"\"))","v":""}]
[{"$f":"'5. Riskanalys'!A30:A31","v":0},{"$f":"'5. Riskanalys'!#REF!","v":{"$error":"#REF!"}},{"$f":"'5. Riskanalys'!#REF!","v":{"$error":"#REF!"}},{"$f":"'5. Riskanalys'!#REF!","v":{"$error":"#REF!"}},{"$f":"'5. Riskanalys'!B30:B31","v":0},{"$f":"'5. Riskanalys'!C30","v":0},{"$f":"'5. Riskanalys'!D30:D31","v":0},{"$f":"'5. Riskanalys'!E30","v":0},{"$f":"'5. Riskanalys'!F30:F31","v":0},{"$f":"'5. Riskanalys'!G30","v":0},{"$f":"'5. Riskanalys'!H30","v":"Kvalitet"},{"$f":"'5. Riskanalys'!I30","v":{"$error":"#N/A"}},{"$f":"'5. Riskanalys'!J30","v":{"$error":"#N/A"}},{"$f":"'5. Riskanalys'!K30","v":{"$error":"#N/A"}},{"$f":"IF('5. Riskanalys'!L30=\"x\",\"x\",IF('5. Riskanalys'!M30<>\"\",\"x\",\"\"))","v":""}]
[null,null,null,null,null,{"$f":"'5. Riskanalys'!C31","v":0},null,{"$f":"'5. Riskanalys'!E31","v":0},null,{"$f":"'5. Riskanalys'!G31","v":0},{"$f":"'5. Riskanalys'!H31","v":"Leverans"},{"$f":"'5. Riskanalys'!I31","v":{"$error":"#N/A"}},{"$f":"'5. Riskanalys'!J31","v":{"$error":"#N/A"}},{"$f":"'5. Riskanalys'!K31","v":{"$error":"#N/A"}},{"$f":"IF('5. Riskanalys'!L31=\"x\",\"x\",IF('5. Riskanalys'!M31<>\"\",\"x\",\"\"))","v":""}]
[{"$f":"'5. Riskanalys'!A32:A33","v":0},{"$f":"'5. Riskanalys'!#REF!","v":{"$error":"#REF!"}},{"$f":"'5. Riskanalys'!#REF!","v":{"$error":"#REF!"}},{"$f":"'5. Riskanalys'!#REF!","v":{"$error":"#REF!"}},{"$f":"'5. Riskanalys'!B32:B33","v":0},{"$f":"'5. Riskanalys'!C32","v":0},{"$f":"'5. Riskanalys'!D32:D33","v":0},{"$f":"'5. Riskanalys'!E32","v":0},{"$f":"'5. Riskanalys'!F32:F33","v":0},{"$f":"'5. Riskanalys'!G32","v":0},{"$f":"'5. Riskanalys'!H32","v":"Kvalitet"},{"$f":"'5. Riskanalys'!I32","v":{"$error":"#N/A"}},{"$f":"'5. Riskanalys'!J32","v":{"$error":"#N/A"}},{"$f":"'5. Riskanalys'!K32","v":{"$error":"#N/A"}},{"$f":"IF('5. Riskanalys'!L32=\"x\",\"x\",IF('5. Riskanalys'!M32<>\"\",\"x\",\"\"))","v":""}]
[null,null,null,null,null,{"$f":"'5. Riskanalys'!C33","v":0},null,{"$f":"'5. Riskanalys'!E33","v":0},null,{"$f":"'5. Riskanalys'!G33","v":0},{"$f":"'5. Riskanalys'!H33","v":"Leverans"},{"$f":"'5. Riskanalys'!I33","v":{"$error":"#N/A"}},{"$f":"'5. Riskanalys'!J33","v":{"$error":"#N/A"}},{"$f":"'5. Riskanalys'!K33","v":{"$error":"#N/A"}},{"$f":"IF('5. Riskanalys'!L33=\"x\",\"x\",IF('5. Riskanalys'!M33<>\"\",\"x\",\"\"))","v":""}]
[{"$f":"'5. Riskanalys'!A34:A35","v":0},{"$f":"'5. Riskanalys'!#REF!","v":{"$error":"#REF!"}},{"$f":"'5. Riskanalys'!#REF!","v":{"$error":"#REF!"}},{"$f":"'5. Riskanalys'!#REF!","v":{"$error":"#REF!"}},{"$f":"'5. Riskanalys'!B34:B35","v":0},{"$f":"'5. Riskanalys'!C34","v":0},{"$f":"'5. Riskanalys'!D34:D35","v":0},{"$f":"'5. Riskanalys'!E34","v":0},{"$f":"'5. Riskanalys'!F34:F35","v":0},{"$f":"'5. Riskanalys'!G34","v":0},{"$f":"'5. Riskanalys'!H34","v":"Kvalitet"},{"$f":"'5. Riskanalys'!I34","v":{"$error":"#N/A"}},{"$f":"'5. Riskanalys'!J34","v":{"$error":"#N/A"}},{"$f":"'5. Riskanalys'!K34","v":{"$error":"#N/A"}},{"$f":"IF('5. Riskanalys'!L34=\"x\",\"x\",IF('5. Riskanalys'!M34<>\"\",\"x\",\"\"))","v":""}]
[null,null,null,null,null,{"$f":"'5. Riskanalys'!C35","v":0},null,{"$f":"'5. Riskanalys'!E35","v":0},null,{"$f":"'5. Riskanalys'!G35","v":0},{"$f":"'5. Riskanalys'!H35","v":"Leverans"},{"$f":"'5. Riskanalys'!I35","v":{"$error":"#N/A"}},{"$f":"'5. Riskanalys'!J35","v":{"$error":"#N/A"}},{"$f":"'5. Riskanalys'!K35","v":{"$error":"#N/A"}},{"$f":"IF('5. Riskanalys'!L35=\"x\",\"x\",IF('5. Riskanalys'!M35<>\"\",\"x\",\"\"))","v":""}]
[{"$f":"'5. Riskanalys'!A36:A37","v":0},{"$f":"'5. Riskanalys'!#REF!","v":{"$error":"#REF!"}},{"$f":"'5. Riskanalys'!#REF!","v":{"$error":"#REF!"}},{"$f":"'5. Riskanalys'!#REF!","v":{"$error":"#REF!"}},{"$f":"'5. Riskanalys'!B36:B37","v":0},{"$f":"'5. Riskanalys'!C36","v":0},{"$f":"'5. Riskanalys'!D36:D37","v":0},{"$f":"'5. Riskanalys'!E36","v":0},{"$f":"'5. Riskanalys'!F36:F37","v":0},{"$f":"'5. Riskanalys'!G36","v":0},{"$f":"'5. Riskanalys'!H36","v":"Kvalitet"},{"$f":"'5. Riskanalys'!I36","v":{"$error":"#N/A"}},{"$f":"'5. Riskanalys'!J36","v":{"$error":"#N/A"}},{"$f":"'5. Riskanalys'!K36","v":{"$error":"#N/A"}},{"$f":"IF('5. Riskanalys'!L36=\"x\",\"x\",IF('5. Riskanalys'!M36<>\"\",\"x\",\"\"))","v":""}]
[null,null,null,null,null,{"$f":"'5. Riskanalys'!C37","v":0},null,{"$f":"'5. Riskanalys'!E37","v":0},null,{"$f":"'5. Riskanalys'!G37","v":0},{"$f":"'5. Riskanalys'!H37","v":"Leverans"},{"$f":"'5. Riskanalys'!I37","v":{"$error":"#N/A"}},{"$f":"'5. Riskanalys'!J37","v":{"$error":"#N/A"}},{"$f":"'5. Riskanalys'!K37","v":{"$error":"#N/A"}},{"$f":"IF('5. Riskanalys'!L37=\"x\",\"x\",IF('5. Riskanalys'!M37<>\"\",\"x\",\"\"))","v":""}]
[{"$f":"'5. Riskanalys'!A38:A39","v":0},{"$f":"'5. Riskanalys'!#REF!","v":{"$error":"#REF!"}},{"$f":"'5. Riskanalys'!#REF!","v":{"$error":"#REF!"}},{"$f":"'5. Riskanalys'!#REF!","v":{"$error":"#REF!"}},{"$f":"'5. Riskanalys'!B38:B39","v":0},{"$f":"'5. Riskanalys'!C38","v":0},{"$f":"'5. Riskanalys'!D38:D39","v":0},{"$f":"'5. Riskanalys'!E38","v":0},{"$f":"'5. Riskanalys'!F38:F39","v":0},{"$f":"'5. Riskanalys'!G38","v":0},{"$f":"'5. Riskanalys'!H38","v":"Kvalitet"},{"$f":"'5. Riskanalys'!I38","v":{"$error":"#N/A"}},{"$f":"'5. Riskanalys'!J38","v":{"$error":"#N/A"}},{"$f":"'5. Riskanalys'!K38","v":{"$error":"#N/A"}},{"$f":"IF('5. Riskanalys'!L38=\"x\",\"x\",IF('5. Riskanalys'!M38<>\"\",\"x\",\"\"))","v":""}]
[null,null,null,null,null,{"$f":"'5. Riskanalys'!C39","v":0},null,{"$f":"'5. Riskanalys'!E39","v":0},null,{"$f":"'5. Riskanalys'!G39","v":0},{"$f":"'5. Riskanalys'!H39","v":"Leverans"},{"$f":"'5. Riskanalys'!I39","v":{"$error":"#N/A"}},{"$f":"'5. Riskanalys'!J39","v":{"$error":"#N/A"}},{"$f":"'5. Riskanalys'!K39","v":{"$error":"#N/A"}},{"$f":"IF('5. Riskanalys'!L39=\"x\",\"x\",IF('5. Riskanalys'!M39<>\"\",\"x\",\"\"))","v":""}]
[{"$f":"'5. Riskanalys'!A40:A41","v":0},{"$f":"'5. Riskanalys'!#REF!","v":{"$error":"#REF!"}},{"$f":"'5. Riskanalys'!#REF!","v":{"$error":"#REF!"}},{"$f":"'5. Riskanalys'!#REF!","v":{"$error":"#REF!"}},{"$f":"'5. Riskanalys'!B40:B41","v":0},{"$f":"'5. Riskanalys'!C40","v":0},{"$f":"'5. Riskanalys'!D40:D41","v":0},{"$f":"'5. Riskanalys'!E40","v":0},{"$f":"'5. Riskanalys'!F40:F41","v":0},{"$f":"'5. Riskanalys'!G40","v":0},{"$f":"'5. Riskanalys'!H40","v":"Kvalitet"},{"$f":"'5. Riskanalys'!I40","v":{"$error":"#N/A"}},{"$f":"'5. Riskanalys'!J40","v":{"$error":"#N/A"}},{"$f":"'5. Riskanalys'!K40","v":{"$error":"#N/A"}},{"$f":"IF('5. Riskanalys'!L40=\"x\",\"x\",IF('5. Riskanalys'!M40<>\"\",\"x\",\"\"))","v":""}]
[null,null,null,null,null,{"$f":"'5. Riskanalys'!C41","v":0},null,{"$f":"'5. Riskanalys'!E41","v":0},null,{"$f":"'5. Riskanalys'!G41","v":0},{"$f":"'5. Riskanalys'!H41","v":"Leverans"},{"$f":"'5. Riskanalys'!I41","v":{"$error":"#N/A"}},{"$f":"'5. Riskanalys'!J41","v":{"$error":"#N/A"}},{"$f":"'5. Riskanalys'!K41","v":{"$error":"#N/A"}},{"$f":"IF('5. Riskanalys'!L41=\"x\",\"x\",IF('5. Riskanalys'!M41<>\"\",\"x\",\"\"))","v":""}]
[{"$f":"'5. Riskanalys'!A42:A43","v":0},{"$f":"'5. Riskanalys'!#REF!","v":{"$error":"#REF!"}},{"$f":"'5. Riskanalys'!#REF!","v":{"$error":"#REF!"}},{"$f":"'5. Riskanalys'!#REF!","v":{"$error":"#REF!"}},{"$f":"'5. Riskanalys'!B42:B43","v":0},{"$f":"'5. Riskanalys'!C42","v":0},{"$f":"'5. Riskanalys'!D42:D43","v":0},{"$f":"'5. Riskanalys'!E42","v":0},{"$f":"'5. Riskanalys'!F42:F43","v":0},{"$f":"'5. Riskanalys'!G42","v":0},{"$f":"'5. Riskanalys'!H42","v":"Kvalitet"},{"$f":"'5. Riskanalys'!I42","v":{"$error":"#N/A"}},{"$f":"'5. Riskanalys'!J42","v":{"$error":"#N/A"}},{"$f":"'5. Riskanalys'!K42","v":{"$error":"#N/A"}},{"$f":"IF('5. Riskanalys'!L42=\"x\",\"x\",IF('5. Riskanalys'!M42<>\"\",\"x\",\"\"))","v":""}]
[null,null,null,null,null,{"$f":"'5. Riskanalys'!C43","v":0},null,{"$f":"'5. Riskanalys'!E43","v":0},null,{"$f":"'5. Riskanalys'!G43","v":0},{"$f":"'5. Riskanalys'!H43","v":"Leverans"},{"$f":"'5. Riskanalys'!I43","v":{"$error":"#N/A"}},{"$f":"'5. Riskanalys'!J43","v":{"$error":"#N/A"}},{"$f":"'5. Riskanalys'!K43","v":{"$error":"#N/A"}},{"$f":"IF('5. Riskanalys'!L43=\"x\",\"x\",IF('5. Riskanalys'!M43<>\"\",\"x\",\"\"))","v":""}]
[{"$f":"'5. Riskanalys'!A44:A45","v":0},{"$f":"'5. Riskanalys'!#REF!","v":{"$error":"#REF!"}},{"$f":"'5. Riskanalys'!#REF!","v":{"$error":"#REF!"}},{"$f":"'5. Riskanalys'!#REF!","v":{"$error":"#REF!"}},{"$f":"'5. Riskanalys'!B44:B45","v":0},{"$f":"'5. Riskanalys'!C44","v":0},{"$f":"'5. Riskanalys'!D44:D45","v":0},{"$f":"'5. Riskanalys'!E44","v":0},{"$f":"'5. Riskanalys'!F44:F45","v":0},{"$f":"'5. Riskanalys'!G44","v":0},{"$f":"'5. Riskanalys'!H44","v":"Kvalitet"},{"$f":"'5. Riskanalys'!I44","v":{"$error":"#N/A"}},{"$f":"'5. Riskanalys'!J44","v":{"$error":"#N/A"}},{"$f":"'5. Riskanalys'!K44","v":{"$error":"#N/A"}},{"$f":"IF('5. Riskanalys'!L44=\"x\",\"x\",IF('5. Riskanalys'!M44<>\"\",\"x\",\"\"))","v":""}]
[null,null,null,null,null,{"$f":"'5. Riskanalys'!C45","v":0},null,{"$f":"'5. Riskanalys'!E45","v":0},null,{"$f":"'5. Riskanalys'!G45","v":0},{"$f":"'5. Riskanalys'!H45","v":"Leverans"},{"$f":"'5. Riskanalys'!I45","v":{"$error":"#N/A"}},{"$f":"'5. Riskanalys'!J45","v":{"$error":"#N/A"}},{"$f":"'5. Riskanalys'!K45","v":{"$error":"#N/A"}},{"$f":"IF('5. Riskanalys'!L45=\"x\",\"x\",IF('5. Riskanalys'!M45<>\"\",\"x\",\"\"))","v":""}]
[{"$f":"'5. Riskanalys'!A46:A47","v":0},{"$f":"'5. Riskanalys'!#REF!","v":{"$error":"#REF!"}},{"$f":"'5. Riskanalys'!#REF!","v":{"$error":"#REF!"}},{"$f":"'5. Riskanalys'!#REF!","v":{"$error":"#REF!"}},{"$f":"'5. Riskanalys'!B46:B47","v":0},{"$f":"'5. Riskanalys'!C46","v":0},{"$f":"'5. Riskanalys'!D46:D47","v":0},{"$f":"'5. Riskanalys'!E46","v":0},{"$f":"'5. Riskanalys'!F46:F47","v":0},{"$f":"'5. Riskanalys'!G46","v":0},{"$f":"'5. Riskanalys'!H46","v":"Kvalitet"},{"$f":"'5. Riskanalys'!I46","v":{"$error":"#N/A"}},{"$f":"'5. Riskanalys'!J46","v":{"$error":"#N/A"}},{"$f":"'5. Riskanalys'!K46","v":{"$error":"#N/A"}},{"$f":"IF('5. Riskanalys'!L46=\"x\",\"x\",IF('5. Riskanalys'!M46<>\"\",\"x\",\"\"))","v":""}]
[null,null,null,null,null,{"$f":"'5. Riskanalys'!C47","v":0},null,{"$f":"'5. Riskanalys'!E47","v":0},null,{"$f":"'5. Riskanalys'!G47","v":0},{"$f":"'5. Riskanalys'!H47","v":"Leverans"},{"$f":"'5. Riskanalys'!I47","v":{"$error":"#N/A"}},{"$f":"'5. Riskanalys'!J47","v":{"$error":"#N/A"}},{"$f":"'5. Riskanalys'!K47","v":{"$error":"#N/A"}},{"$f":"IF('5. Riskanalys'!L47=\"x\",\"x\",IF('5. Riskanalys'!M47<>\"\",\"x\",\"\"))","v":""}]
[{"$f":"'5. Riskanalys'!A48:A49","v":0},{"$f":"'5. Riskanalys'!#REF!","v":{"$error":"#REF!"}},{"$f":"'5. Riskanalys'!#REF!","v":{"$error":"#REF!"}},{"$f":"'5. Riskanalys'!#REF!","v":{"$error":"#REF!"}},{"$f":"'5. Riskanalys'!B48:B49","v":0},{"$f":"'5. Riskanalys'!C48","v":0},{"$f":"'5. Riskanalys'!D48:D49","v":0},{"$f":"'5. Riskanalys'!E48","v":0},{"$f":"'5. Riskanalys'!F48:F49","v":0},{"$f":"'5. Riskanalys'!G48","v":0},{"$f":"'5. Riskanalys'!H48","v":"Kvalitet"},{"$f":"'5. Riskanalys'!I48","v":{"$error":"#N/A"}},{"$f":"'5. Riskanalys'!J48","v":{"$error":"#N/A"}},{"$f":"'5. Riskanalys'!K48","v":{"$error":"#N/A"}},{"$f":"IF('5. Riskanalys'!L48=\"x\",\"x\",IF('5. Riskanalys'!M48<>\"\",\"x\",\"\"))","v":""}]
[null,null,null,null,null,{"$f":"'5. Riskanalys'!C49","v":0},null,{"$f":"'5. Riskanalys'!E49","v":0},null,{"$f":"'5. Riskanalys'!G49","v":0},{"$f":"'5. Riskanalys'!H49","v":"Leverans"},{"$f":"'5. Riskanalys'!I49","v":{"$error":"#N/A"}},{"$f":"'5. Riskanalys'!J49","v":{"$error":"#N/A"}},{"$f":"'5. Riskanalys'!K49","v":{"$error":"#N/A"}},{"$f":"IF('5. Riskanalys'!L49=\"x\",\"x\",IF('5. Riskanalys'!M49<>\"\",\"x\",\"\"))","v":""}]
[{"$f":"'5. Riskanalys'!A50:A51","v":0},{"$f":"'5. Riskanalys'!#REF!","v":{"$error":"#REF!"}},{"$f":"'5. Riskanalys'!#REF!","v":{"$error":"#REF!"}},{"$f":"'5. Riskanalys'!#REF!","v":{"$error":"#REF!"}},{"$f":"'5. Riskanalys'!B50:B51","v":0},{"$f":"'5. Riskanalys'!C50","v":0},{"$f":"'5. Riskanalys'!D50:D51","v":0},{"$f":"'5. Riskanalys'!E50","v":0},{"$f":"'5. Riskanalys'!F50:F51","v":0},{"$f":"'5. Riskanalys'!G50","v":0},{"$f":"'5. Riskanalys'!H50","v":"Kvalitet"},{"$f":"'5. Riskanalys'!I50","v":{"$error":"#N/A"}},{"$f":"'5. Riskanalys'!J50","v":{"$error":"#N/A"}},{"$f":"'5. Riskanalys'!K50","v":{"$error":"#N/A"}},{"$f":"IF('5. Riskanalys'!L50=\"x\",\"x\",IF('5. Riskanalys'!M50<>\"\",\"x\",\"\"))","v":""}]
[null,null,null,null,null,{"$f":"'5. Riskanalys'!C51","v":0},null,{"$f":"'5. Riskanalys'!E51","v":0},null,{"$f":"'5. Riskanalys'!G51","v":0},{"$f":"'5. Riskanalys'!H51","v":"Leverans"},{"$f":"'5. Riskanalys'!I51","v":{"$error":"#N/A"}},{"$f":"'5. Riskanalys'!J51","v":{"$error":"#N/A"}},{"$f":"'5. Riskanalys'!K51","v":{"$error":"#N/A"}},{"$f":"IF('5. Riskanalys'!L51=\"x\",\"x\",IF('5. Riskanalys'!M51<>\"\",\"x\",\"\"))","v":""}]
[{"$f":"'5. Riskanalys'!A52:A53","v":0},{"$f":"'5. Riskanalys'!#REF!","v":{"$error":"#REF!"}},{"$f":"'5. Riskanalys'!#REF!","v":{"$error":"#REF!"}},{"$f":"'5. Riskanalys'!#REF!","v":{"$error":"#REF!"}},{"$f":"'5. Riskanalys'!B52:B53","v":0},{"$f":"'5. Riskanalys'!C52","v":0},{"$f":"'5. Riskanalys'!D52:D53","v":0},{"$f":"'5. Riskanalys'!E52","v":0},{"$f":"'5. Riskanalys'!F52:F53","v":0},{"$f":"'5. Riskanalys'!G52","v":0},{"$f":"'5. Riskanalys'!H52","v":"Kvalitet"},{"$f":"'5. Riskanalys'!I52","v":{"$error":"#N/A"}},{"$f":"'5. Riskanalys'!J52","v":{"$error":"#N/A"}},{"$f":"'5. Riskanalys'!K52","v":{"$error":"#N/A"}},{"$f":"IF('5. Riskanalys'!L52=\"x\",\"x\",IF('5. Riskanalys'!M52<>\"\",\"x\",\"\"))","v":""}]
[null,null,null,null,null,{"$f":"'5. Riskanalys'!C53","v":0},null,{"$f":"'5. Riskanalys'!E53","v":0},null,{"$f":"'5. Riskanalys'!G53","v":0},{"$f":"'5. Riskanalys'!H53","v":"Leverans"},{"$f":"'5. Riskanalys'!I53","v":{"$error":"#N/A"}},{"$f":"'5. Riskanalys'!J53","v":{"$error":"#N/A"}},{"$f":"'5. Riskanalys'!K53","v":{"$error":"#N/A"}},{"$f":"IF('5. Riskanalys'!L53=\"x\",\"x\",IF('5. Riskanalys'!M53<>\"\",\"x\",\"\"))","v":""}]
[{"$f":"'5. Riskanalys'!A54:A55","v":0},{"$f":"'5. Riskanalys'!#REF!","v":{"$error":"#REF!"}},{"$f":"'5. Riskanalys'!#REF!","v":{"$error":"#REF!"}},{"$f":"'5. Riskanalys'!#REF!","v":{"$error":"#REF!"}},{"$f":"'5. Riskanalys'!B54:B55","v":0},{"$f":"'5. Riskanalys'!C54","v":0},{"$f":"'5. Riskanalys'!D54:D55","v":0},{"$f":"'5. Riskanalys'!E54","v":0},{"$f":"'5. Riskanalys'!F54:F55","v":0},{"$f":"'5. Riskanalys'!G54","v":0},{"$f":"'5. Riskanalys'!H54","v":"Kvalitet"},{"$f":"'5. Riskanalys'!I54","v":{"$error":"#N/A"}},{"$f":"'5. Riskanalys'!J54","v":{"$error":"#N/A"}},{"$f":"'5. Riskanalys'!K54","v":{"$error":"#N/A"}},{"$f":"IF('5. Riskanalys'!L54=\"x\",\"x\",IF('5. Riskanalys'!M54<>\"\",\"x\",\"\"))","v":""}]
[null,null,null,null,null,{"$f":"'5. Riskanalys'!C55","v":0},null,{"$f":"'5. Riskanalys'!E55","v":0},null,{"$f":"'5. Riskanalys'!G55","v":0},{"$f":"'5. Riskanalys'!H55","v":"Leverans"},{"$f":"'5. Riskanalys'!I55","v":{"$error":"#N/A"}},{"$f":"'5. Riskanalys'!J55","v":{"$error":"#N/A"}},{"$f":"'5. Riskanalys'!K55","v":{"$error":"#N/A"}},{"$f":"IF('5. Riskanalys'!L55=\"x\",\"x\",IF('5. Riskanalys'!M55<>\"\",\"x\",\"\"))","v":""}]
[{"$f":"'5. Riskanalys'!A56:A57","v":"Påverkan från bekämpningsmedel eller konstgödsel"},{"$f":"'5. Riskanalys'!#REF!","v":{"$error":"#REF!"}},{"$f":"'5. Riskanalys'!#REF!","v":{"$error":"#REF!"}},{"$f":"'5. Riskanalys'!#REF!","v":{"$error":"#REF!"}},{"$f":"'5. Riskanalys'!B56:B57","v":2},{"$f":"'5. Riskanalys'!C56","v":2},{"$f":"'5. Riskanalys'!D56:D57","v":2},{"$f":"'5. Riskanalys'!E56","v":2},{"$f":"'5. Riskanalys'!F56:F57","v":3},{"$f":"'5. Riskanalys'!G56","v":2},{"$f":"'5. Riskanalys'!H56","v":"Kvalitet"},{"$f":"'5. Riskanalys'!I56","v":10},{"$f":"'5. Riskanalys'!J56","v":10},{"$f":"'5. Riskanalys'!K56","v":15},{"$f":"IF('5. Riskanalys'!L56=\"x\",\"x\",IF('5. Riskanalys'!M56<>\"\",\"x\",\"\"))","v":"x"},"Att inga bekämpningsmedel används i närområdet till vattentäkten och att användningen av konstgödsel begränsas.   ","Upprätta vattenskyddsområde\nAnlägga grundvattenrör i området för att identifieras flödesriktningar samt att ha möjlighet att ta vattenprover i tillrinningsområdet"]
[null,null,null,null,null,{"$f":"'5. Riskanalys'!C57","v":2},null,{"$f":"'5. Riskanalys'!E57","v":2},null,{"$f":"'5. Riskanalys'!G57","v":2},{"$f":"'5. Riskanalys'!H57","v":"Leverans"},{"$f":"'5. Riskanalys'!I57","v":10},{"$f":"'5. Riskanalys'!J57","v":10},{"$f":"'5. Riskanalys'!K57","v":15},{"$f":"IF('5. Riskanalys'!L57=\"x\",\"x\",IF('5. Riskanalys'!M57<>\"\",\"x\",\"\"))","v":"x"}]
[{"$f":"'5. Riskanalys'!A58:A59","v":"Förorening pga bräddning av uppströms liggande avloppsreningsverk"},{"$f":"'5. Riskanalys'!#REF!","v":{"$error":"#REF!"}},{"$f":"'5. Riskanalys'!#REF!","v":{"$error":"#REF!"}},{"$f":"'5. Riskanalys'!#REF!","v":{"$error":"#REF!"}},{"$f":"'5. Riskanalys'!B58:B59","v":1},{"$f":"'5. Riskanalys'!C58","v":2},{"$f":"'5. Riskanalys'!D58:D59","v":2},{"$f":"'5. Riskanalys'!E58","v":2},{"$f":"'5. Riskanalys'!F58:F59","v":2},{"$f":"'5. Riskanalys'!G58","v":2},{"$f":"'5. Riskanalys'!H58","v":"Kvalitet"},{"$f":"'5. Riskanalys'!I58","v":5},{"$f":"'5. Riskanalys'!J58","v":10},{"$f":"'5. Riskanalys'!K58","v":10},{"$f":"IF('5. Riskanalys'!L58=\"x\",\"x\",IF('5. Riskanalys'!M58<>\"\",\"x\",\"\"))","v":""}]
[null,null,null,null,null,{"$f":"'5. Riskanalys'!C59","v":1},null,{"$f":"'5. Riskanalys'!E59","v":1},null,{"$f":"'5. Riskanalys'!G59","v":1},{"$f":"'5. Riskanalys'!H59","v":"Leverans"},{"$f":"'5. Riskanalys'!I59","v":1},{"$f":"'5. Riskanalys'!J59","v":2},{"$f":"'5. Riskanalys'!K59","v":2},{"$f":"IF('5. Riskanalys'!L59=\"x\",\"x\",IF('5. Riskanalys'!M59<>\"\",\"x\",\"\"))","v":""}]
[{"$f":"'5. Riskanalys'!A60:A61","v":"Översvämning av jordbruksmark som leder till att vattentäkten påverkas. Huvudsakliga risker bedöms vara påverkan av mikrbiologiska föroreningar samt ökade halter näringsämnen. "},{"$f":"'5. Riskanalys'!#REF!","v":{"$error":"#REF!"}},{"$f":"'5. Riskanalys'!#REF!","v":{"$error":"#REF!"}},{"$f":"'5. Riskanalys'!#REF!","v":{"$error":"#REF!"}},{"$f":"'5. Riskanalys'!B60:B61","v":2},{"$f":"'5. Riskanalys'!C60","v":2},{"$f":"'5. Riskanalys'!D60:D61","v":2},{"$f":"'5. Riskanalys'!E60","v":2},{"$f":"'5. Riskanalys'!F60:F61","v":3},{"$f":"'5. Riskanalys'!G60","v":2},{"$f":"'5. Riskanalys'!H60","v":"Kvalitet"},{"$f":"'5. Riskanalys'!I60","v":10},{"$f":"'5. Riskanalys'!J60","v":10},{"$f":"'5. Riskanalys'!K60","v":15},{"$f":"IF('5. Riskanalys'!L60=\"x\",\"x\",IF('5. Riskanalys'!M60<>\"\",\"x\",\"\"))","v":"x"},"Att råvattenkvaliteten skall uppfylla Livsmedelsverkets krav (gränsvärden) för mikrobiologiska föroreningar och näringsämnen för dricksvatten","Steg 1. Anlägga grundvattenrör i området för att identifiera flödesriktningar samt att ha möjlighet att ta vattenprover i tillrinningsområdet"]
[null,null,null,null,null,{"$f":"'5. Riskanalys'!C61","v":2},null,{"$f":"'5. Riskanalys'!E61","v":2},null,{"$f":"'5. Riskanalys'!G61","v":2},{"$f":"'5. Riskanalys'!H61","v":"Leverans"},{"$f":"'5. Riskanalys'!I61","v":10},{"$f":"'5. Riskanalys'!J61","v":10},{"$f":"'5. Riskanalys'!K61","v":15},{"$f":"IF('5. Riskanalys'!L61=\"x\",\"x\",IF('5. Riskanalys'!M61<>\"\",\"x\",\"\"))","v":"x"}]
[{"$f":"'5. Riskanalys'!A62:A63","v":0},{"$f":"'5. Riskanalys'!#REF!","v":{"$error":"#REF!"}},{"$f":"'5. Riskanalys'!#REF!","v":{"$error":"#REF!"}},{"$f":"'5. Riskanalys'!#REF!","v":{"$error":"#REF!"}},{"$f":"'5. Riskanalys'!B62:B63","v":0},{"$f":"'5. Riskanalys'!C62","v":0},{"$f":"'5. Riskanalys'!D62:D63","v":0},{"$f":"'5. Riskanalys'!E62","v":0},{"$f":"'5. Riskanalys'!F62:F63","v":0},{"$f":"'5. Riskanalys'!G62","v":0},{"$f":"'5. Riskanalys'!H62","v":"Kvalitet"},{"$f":"'5. Riskanalys'!I62","v":{"$error":"#N/A"}},{"$f":"'5. Riskanalys'!J62","v":{"$error":"#N/A"}},{"$f":"'5. Riskanalys'!K62","v":{"$error":"#N/A"}},{"$f":"IF('5. Riskanalys'!L62=\"x\",\"x\",IF('5. Riskanalys'!M62<>\"\",\"x\",\"\"))","v":""}]
[null,null,null,null,null,{"$f":"'5. Riskanalys'!C63","v":0},null,{"$f":"'5. Riskanalys'!E63","v":0},null,{"$f":"'5. Riskanalys'!G63","v":0},{"$f":"'5. Riskanalys'!H63","v":"Leverans"},{"$f":"'5. Riskanalys'!I63","v":{"$error":"#N/A"}},{"$f":"'5. Riskanalys'!J63","v":{"$error":"#N/A"}},{"$f":"'5. Riskanalys'!K63","v":{"$error":"#N/A"}},{"$f":"IF('5. Riskanalys'!L63=\"x\",\"x\",IF('5. Riskanalys'!M63<>\"\",\"x\",\"\"))","v":""}]
[{"$f":"'5. Riskanalys'!A64:A65","v":0},{"$f":"'5. Riskanalys'!#REF!","v":{"$error":"#REF!"}},{"$f":"'5. Riskanalys'!#REF!","v":{"$error":"#REF!"}},{"$f":"'5. Riskanalys'!#REF!","v":{"$error":"#REF!"}},{"$f":"'5. Riskanalys'!B64:B65","v":0},{"$f":"'5. Riskanalys'!C64","v":0},{"$f":"'5. Riskanalys'!D64:D65","v":0},{"$f":"'5. Riskanalys'!E64","v":0},{"$f":"'5. Riskanalys'!F64:F65","v":0},{"$f":"'5. Riskanalys'!G64","v":0},{"$f":"'5. Riskanalys'!H64","v":"Kvalitet"},{"$f":"'5. Riskanalys'!I64","v":{"$error":"#N/A"}},{"$f":"'5. Riskanalys'!J64","v":{"$error":"#N/A"}},{"$f":"'5. Riskanalys'!K64","v":{"$error":"#N/A"}},{"$f":"IF('5. Riskanalys'!L64=\"x\",\"x\",IF('5. Riskanalys'!M64<>\"\",\"x\",\"\"))","v":""}]
[null,null,null,null,null,{"$f":"'5. Riskanalys'!C65","v":0},null,{"$f":"'5. Riskanalys'!E65","v":0},null,{"$f":"'5. Riskanalys'!G65","v":0},{"$f":"'5. Riskanalys'!H65","v":"Leverans"},{"$f":"'5. Riskanalys'!I65","v":{"$error":"#N/A"}},{"$f":"'5. Riskanalys'!J65","v":{"$error":"#N/A"}},{"$f":"'5. Riskanalys'!K65","v":{"$error":"#N/A"}},{"$f":"IF('5. Riskanalys'!L65=\"x\",\"x\",IF('5. Riskanalys'!M65<>\"\",\"x\",\"\"))","v":""}]
[{"$f":"'5. Riskanalys'!A66:A67","v":0},{"$f":"'5. Riskanalys'!#REF!","v":{"$error":"#REF!"}},{"$f":"'5. Riskanalys'!#REF!","v":{"$error":"#REF!"}},{"$f":"'5. Riskanalys'!#REF!","v":{"$error":"#REF!"}},{"$f":"'5. Riskanalys'!B66:B67","v":0},{"$f":"'5. Riskanalys'!C66","v":0},{"$f":"'5. Riskanalys'!D66:D67","v":0},{"$f":"'5. Riskanalys'!E66","v":0},{"$f":"'5. Riskanalys'!F66:F67","v":0},{"$f":"'5. Riskanalys'!G66","v":0},{"$f":"'5. Riskanalys'!H66","v":"Kvalitet"},{"$f":"'5. Riskanalys'!I66","v":{"$error":"#N/A"}},{"$f":"'5. Riskanalys'!J66","v":{"$error":"#N/A"}},{"$f":"'5. Riskanalys'!K66","v":{"$error":"#N/A"}},{"$f":"IF('5. Riskanalys'!L66=\"x\",\"x\",IF('5. Riskanalys'!M66<>\"\",\"x\",\"\"))","v":""}]
[null,null,null,null,null,{"$f":"'5. Riskanalys'!C67","v":0},null,{"$f":"'5. Riskanalys'!E67","v":0},null,{"$f":"'5. Riskanalys'!G67","v":0},{"$f":"'5. Riskanalys'!H67","v":"Leverans"},{"$f":"'5. Riskanalys'!I67","v":{"$error":"#N/A"}},{"$f":"'5. Riskanalys'!J67","v":{"$error":"#N/A"}},{"$f":"'5. Riskanalys'!K67","v":{"$error":"#N/A"}},{"$f":"IF('5. Riskanalys'!L67=\"x\",\"x\",IF('5. Riskanalys'!M67<>\"\",\"x\",\"\"))","v":""}]
[{"$f":"'5. Riskanalys'!A68:A69","v":0},{"$f":"'5. Riskanalys'!#REF!","v":{"$error":"#REF!"}},{"$f":"'5. Riskanalys'!#REF!","v":{"$error":"#REF!"}},{"$f":"'5. Riskanalys'!#REF!","v":{"$error":"#REF!"}},{"$f":"'5. Riskanalys'!B68:B69","v":0},{"$f":"'5. Riskanalys'!C68","v":0},{"$f":"'5. Riskanalys'!D68:D69","v":0},{"$f":"'5. Riskanalys'!E68","v":0},{"$f":"'5. Riskanalys'!F68:F69","v":0},{"$f":"'5. Riskanalys'!G68","v":0},{"$f":"'5. Riskanalys'!H68","v":"Kvalitet"},{"$f":"'5. Riskanalys'!I68","v":{"$error":"#N/A"}},{"$f":"'5. Riskanalys'!J68","v":{"$error":"#N/A"}},{"$f":"'5. Riskanalys'!K68","v":{"$error":"#N/A"}},{"$f":"IF('5. Riskanalys'!L68=\"x\",\"x\",IF('5. Riskanalys'!M68<>\"\",\"x\",\"\"))","v":""}]
[null,null,null,null,null,{"$f":"'5. Riskanalys'!C69","v":0},null,{"$f":"'5. Riskanalys'!E69","v":0},null,{"$f":"'5. Riskanalys'!G69","v":0},{"$f":"'5. Riskanalys'!H69","v":"Leverans"},{"$f":"'5. Riskanalys'!I69","v":{"$error":"#N/A"}},{"$f":"'5. Riskanalys'!J69","v":{"$error":"#N/A"}},{"$f":"'5. Riskanalys'!K69","v":{"$error":"#N/A"}},{"$f":"IF('5. Riskanalys'!L69=\"x\",\"x\",IF('5. Riskanalys'!M69<>\"\",\"x\",\"\"))","v":""}]
[{"$f":"'5. Riskanalys'!A70:A71","v":0},{"$f":"'5. Riskanalys'!#REF!","v":{"$error":"#REF!"}},{"$f":"'5. Riskanalys'!#REF!","v":{"$error":"#REF!"}},{"$f":"'5. Riskanalys'!#REF!","v":{"$error":"#REF!"}},{"$f":"'5. Riskanalys'!B70:B71","v":0},{"$f":"'5. Riskanalys'!C70","v":0},{"$f":"'5. Riskanalys'!D70:D71","v":0},{"$f":"'5. Riskanalys'!E70","v":0},{"$f":"'5. Riskanalys'!F70:F71","v":0},{"$f":"'5. Riskanalys'!G70","v":0},{"$f":"'5. Riskanalys'!H70","v":"Kvalitet"},{"$f":"'5. Riskanalys'!I70","v":{"$error":"#N/A"}},{"$f":"'5. Riskanalys'!J70","v":{"$error":"#N/A"}},{"$f":"'5. Riskanalys'!K70","v":{"$error":"#N/A"}},{"$f":"IF('5. Riskanalys'!L70=\"x\",\"x\",IF('5. Riskanalys'!M70<>\"\",\"x\",\"\"))","v":""}]
[null,null,null,null,null,{"$f":"'5. Riskanalys'!C71","v":0},null,{"$f":"'5. Riskanalys'!E71","v":0},null,{"$f":"'5. Riskanalys'!G71","v":0},{"$f":"'5. Riskanalys'!H71","v":"Leverans"},{"$f":"'5. Riskanalys'!I71","v":{"$error":"#N/A"}},{"$f":"'5. Riskanalys'!J71","v":{"$error":"#N/A"}},{"$f":"'5. Riskanalys'!K71","v":{"$error":"#N/A"}},{"$f":"IF('5. Riskanalys'!L71=\"x\",\"x\",IF('5. Riskanalys'!M71<>\"\",\"x\",\"\"))","v":""}]
[{"$f":"'5. Riskanalys'!A72:A73","v":0},{"$f":"'5. Riskanalys'!#REF!","v":{"$error":"#REF!"}},{"$f":"'5. Riskanalys'!#REF!","v":{"$error":"#REF!"}},{"$f":"'5. Riskanalys'!#REF!","v":{"$error":"#REF!"}},{"$f":"'5. Riskanalys'!B72:B73","v":0},{"$f":"'5. Riskanalys'!C72","v":0},{"$f":"'5. Riskanalys'!D72:D73","v":0},{"$f":"'5. Riskanalys'!E72","v":0},{"$f":"'5. Riskanalys'!F72:F73","v":0},{"$f":"'5. Riskanalys'!G72","v":0},{"$f":"'5. Riskanalys'!H72","v":"Kvalitet"},{"$f":"'5. Riskanalys'!I72","v":{"$error":"#N/A"}},{"$f":"'5. Riskanalys'!J72","v":{"$error":"#N/A"}},{"$f":"'5. Riskanalys'!K72","v":{"$error":"#N/A"}},{"$f":"IF('5. Riskanalys'!L72=\"x\",\"x\",IF('5. Riskanalys'!M72<>\"\",\"x\",\"\"))","v":""}]
[null,null,null,null,null,{"$f":"'5. Riskanalys'!C73","v":0},null,{"$f":"'5. Riskanalys'!E73","v":0},null,{"$f":"'5. Riskanalys'!G73","v":0},{"$f":"'5. Riskanalys'!H73","v":"Leverans"},{"$f":"'5. Riskanalys'!I73","v":{"$error":"#N/A"}},{"$f":"'5. Riskanalys'!J73","v":{"$error":"#N/A"}},{"$f":"'5. Riskanalys'!K73","v":{"$error":"#N/A"}},{"$f":"IF('5. Riskanalys'!L73=\"x\",\"x\",IF('5. Riskanalys'!M73<>\"\",\"x\",\"\"))","v":""}]
[{"$f":"'5. Riskanalys'!A74:A75","v":0},{"$f":"'5. Riskanalys'!#REF!","v":{"$error":"#REF!"}},{"$f":"'5. Riskanalys'!#REF!","v":{"$error":"#REF!"}},{"$f":"'5. Riskanalys'!#REF!","v":{"$error":"#REF!"}},{"$f":"'5. Riskanalys'!B74:B75","v":0},{"$f":"'5. Riskanalys'!C74","v":0},{"$f":"'5. Riskanalys'!D74:D75","v":0},{"$f":"'5. Riskanalys'!E74","v":0},{"$f":"'5. Riskanalys'!F74:F75","v":0},{"$f":"'5. Riskanalys'!G74","v":0},{"$f":"'5. Riskanalys'!H74","v":"Kvalitet"},{"$f":"'5. Riskanalys'!I74","v":{"$error":"#N/A"}},{"$f":"'5. Riskanalys'!J74","v":{"$error":"#N/A"}},{"$f":"'5. Riskanalys'!K74","v":{"$error":"#N/A"}},{"$f":"IF('5. Riskanalys'!L74=\"x\",\"x\",IF('5. Riskanalys'!M74<>\"\",\"x\",\"\"))","v":""}]
[null,null,null,null,null,{"$f":"'5. Riskanalys'!C75","v":0},null,{"$f":"'5. Riskanalys'!E75","v":0},null,{"$f":"'5. Riskanalys'!G75","v":0},{"$f":"'5. Riskanalys'!H75","v":"Leverans"},{"$f":"'5. Riskanalys'!I75","v":{"$error":"#N/A"}},{"$f":"'5. Riskanalys'!J75","v":{"$error":"#N/A"}},{"$f":"'5. Riskanalys'!K75","v":{"$error":"#N/A"}},{"$f":"IF('5. Riskanalys'!L75=\"x\",\"x\",IF('5. Riskanalys'!M75<>\"\",\"x\",\"\"))","v":""}]
[{"$f":"'5. Riskanalys'!A76:A77","v":0},{"$f":"'5. Riskanalys'!#REF!","v":{"$error":"#REF!"}},{"$f":"'5. Riskanalys'!#REF!","v":{"$error":"#REF!"}},{"$f":"'5. Riskanalys'!#REF!","v":{"$error":"#REF!"}},{"$f":"'5. Riskanalys'!B76:B77","v":0},{"$f":"'5. Riskanalys'!C76","v":0},{"$f":"'5. Riskanalys'!D76:D77","v":0},{"$f":"'5. Riskanalys'!E76","v":0},{"$f":"'5. Riskanalys'!F76:F77","v":0},{"$f":"'5. Riskanalys'!G76","v":0},{"$f":"'5. Riskanalys'!H76","v":"Kvalitet"},{"$f":"'5. Riskanalys'!I76","v":{"$error":"#N/A"}},{"$f":"'5. Riskanalys'!J76","v":{"$error":"#N/A"}},{"$f":"'5. Riskanalys'!K76","v":{"$error":"#N/A"}},{"$f":"IF('5. Riskanalys'!L76=\"x\",\"x\",IF('5. Riskanalys'!M76<>\"\",\"x\",\"\"))","v":""}]
[null,null,null,null,null,{"$f":"'5. Riskanalys'!C77","v":0},null,{"$f":"'5. Riskanalys'!E77","v":0},null,{"$f":"'5. Riskanalys'!G77","v":0},{"$f":"'5. Riskanalys'!H77","v":"Leverans"},{"$f":"'5. Riskanalys'!I77","v":{"$error":"#N/A"}},{"$f":"'5. Riskanalys'!J77","v":{"$error":"#N/A"}},{"$f":"'5. Riskanalys'!K77","v":{"$error":"#N/A"}},{"$f":"IF('5. Riskanalys'!L77=\"x\",\"x\",IF('5. Riskanalys'!M77<>\"\",\"x\",\"\"))","v":""}]
[{"$f":"'5. Riskanalys'!A78:A79","v":0},{"$f":"'5. Riskanalys'!#REF!","v":{"$error":"#REF!"}},{"$f":"'5. Riskanalys'!#REF!","v":{"$error":"#REF!"}},{"$f":"'5. Riskanalys'!#REF!","v":{"$error":"#REF!"}},{"$f":"'5. Riskanalys'!B78:B79","v":0},{"$f":"'5. Riskanalys'!C78","v":0},{"$f":"'5. Riskanalys'!D78:D79","v":0},{"$f":"'5. Riskanalys'!E78","v":0},{"$f":"'5. Riskanalys'!F78:F79","v":0},{"$f":"'5. Riskanalys'!G78","v":0},{"$f":"'5. Riskanalys'!H78","v":"Kvalitet"},{"$f":"'5. Riskanalys'!I78","v":{"$error":"#N/A"}},{"$f":"'5. Riskanalys'!J78","v":{"$error":"#N/A"}},{"$f":"'5. Riskanalys'!K78","v":{"$error":"#N/A"}},{"$f":"IF('5. Riskanalys'!L78=\"x\",\"x\",IF('5. Riskanalys'!M78<>\"\",\"x\",\"\"))","v":""}]
[null,null,null,null,null,{"$f":"'5. Riskanalys'!C79","v":0},null,{"$f":"'5. Riskanalys'!E79","v":0},null,{"$f":"'5. Riskanalys'!G79","v":0},{"$f":"'5. Riskanalys'!H79","v":"Leverans"},{"$f":"'5. Riskanalys'!I79","v":{"$error":"#N/A"}},{"$f":"'5. Riskanalys'!J79","v":{"$error":"#N/A"}},{"$f":"'5. Riskanalys'!K79","v":{"$error":"#N/A"}},{"$f":"IF('5. Riskanalys'!L79=\"x\",\"x\",IF('5. Riskanalys'!M79<>\"\",\"x\",\"\"))","v":""}]
[{"$f":"'5. Riskanalys'!A80:A81","v":"Vattenbrist pga naturligt sjunkande nivåer"},{"$f":"'5. Riskanalys'!#REF!","v":{"$error":"#REF!"}},{"$f":"'5. Riskanalys'!#REF!","v":{"$error":"#REF!"}},{"$f":"'5. Riskanalys'!#REF!","v":{"$error":"#REF!"}},{"$f":"'5. Riskanalys'!B80:B81","v":2},{"$f":"'5. Riskanalys'!C80","v":1},{"$f":"'5. Riskanalys'!D80:D81","v":2},{"$f":"'5. Riskanalys'!E80","v":1},{"$f":"'5. Riskanalys'!F80:F81","v":3},{"$f":"'5. Riskanalys'!G80","v":1},{"$f":"'5. Riskanalys'!H80","v":"Kvalitet"},{"$f":"'5. Riskanalys'!I80","v":2},{"$f":"'5. Riskanalys'!J80","v":2},{"$f":"'5. Riskanalys'!K80","v":3},{"$f":"IF('5. Riskanalys'!L80=\"x\",\"x\",IF('5. Riskanalys'!M80<>\"\",\"x\",\"\"))","v":""}]
[null,null,null,null,null,{"$f":"'5. Riskanalys'!C81","v":4},null,{"$f":"'5. Riskanalys'!E81","v":4},null,{"$f":"'5. Riskanalys'!G81","v":4},{"$f":"'5. Riskanalys'!H81","v":"Leverans"},{"$f":"'5. Riskanalys'!I81","v":32},{"$f":"'5. Riskanalys'!J81","v":32},{"$f":"'5. Riskanalys'!K81","v":48},{"$f":"IF('5. Riskanalys'!L81=\"x\",\"x\",IF('5. Riskanalys'!M81<>\"\",\"x\",\"\"))","v":"x"},"Målet är att klara en förbrukning på 4000 m3/dygn under kortare perioder (ca 2 månad). ","Anlägga en ny vattentäkt alternativt borra fler/djupare brunnar i ett nytt område."]
[{"$f":"'5. Riskanalys'!A82:A83","v":"Risk för påverkan på teknisk utrustning (pumpar) om brunnarna blir torra vid låga grundvattennivåer."},{"$f":"'5. Riskanalys'!#REF!","v":{"$error":"#REF!"}},{"$f":"'5. Riskanalys'!#REF!","v":{"$error":"#REF!"}},{"$f":"'5. Riskanalys'!#REF!","v":{"$error":"#REF!"}},{"$f":"'5. Riskanalys'!B82:B83","v":1},{"$f":"'5. Riskanalys'!C82","v":1},{"$f":"'5. Riskanalys'!D82:D83","v":1},{"$f":"'5. Riskanalys'!E82","v":1},{"$f":"'5. Riskanalys'!F82:F83","v":2},{"$f":"'5. Riskanalys'!G82","v":1},{"$f":"'5. Riskanalys'!H82","v":"Kvalitet"},{"$f":"'5. Riskanalys'!I82","v":1},{"$f":"'5. Riskanalys'!J82","v":1},{"$f":"'5. Riskanalys'!K82","v":2},{"$f":"IF('5. Riskanalys'!L82=\"x\",\"x\",IF('5. Riskanalys'!M82<>\"\",\"x\",\"\"))","v":""}]
[null,null,null,null,null,{"$f":"'5. Riskanalys'!C83","v":2},null,{"$f":"'5. Riskanalys'!E83","v":2},null,{"$f":"'5. Riskanalys'!G83","v":2},{"$f":"'5. Riskanalys'!H83","v":"Leverans"},{"$f":"'5. Riskanalys'!I83","v":5},{"$f":"'5. Riskanalys'!J83","v":5},{"$f":"'5. Riskanalys'!K83","v":10},{"$f":"IF('5. Riskanalys'!L83=\"x\",\"x\",IF('5. Riskanalys'!M83<>\"\",\"x\",\"\"))","v":""}]
[{"$f":"'5. Riskanalys'!A84:A85","v":0},{"$f":"'5. Riskanalys'!#REF!","v":{"$error":"#REF!"}},{"$f":"'5. Riskanalys'!#REF!","v":{"$error":"#REF!"}},{"$f":"'5. Riskanalys'!#REF!","v":{"$error":"#REF!"}},{"$f":"'5. Riskanalys'!B84:B85","v":0},{"$f":"'5. Riskanalys'!C84","v":0},{"$f":"'5. Riskanalys'!D84:D85","v":0},{"$f":"'5. Riskanalys'!E84","v":0},{"$f":"'5. Riskanalys'!F84:F85","v":0},{"$f":"'5. Riskanalys'!G84","v":0},{"$f":"'5. Riskanalys'!H84","v":"Kvalitet"},{"$f":"'5. Riskanalys'!I84","v":{"$error":"#N/A"}},{"$f":"'5. Riskanalys'!J84","v":{"$error":"#N/A"}},{"$f":"'5. Riskanalys'!K84","v":{"$error":"#N/A"}},{"$f":"IF('5. Riskanalys'!L84=\"x\",\"x\",IF('5. Riskanalys'!M84<>\"\",\"x\",\"\"))","v":""}]
[null,null,null,null,null,{"$f":"'5. Riskanalys'!C85","v":0},null,{"$f":"'5. Riskanalys'!E85","v":0},null,{"$f":"'5. Riskanalys'!G85","v":0},{"$f":"'5. Riskanalys'!H85","v":"Leverans"},{"$f":"'5. Riskanalys'!I85","v":{"$error":"#N/A"}},{"$f":"'5. Riskanalys'!J85","v":{"$error":"#N/A"}},{"$f":"'5. Riskanalys'!K85","v":{"$error":"#N/A"}},{"$f":"IF('5. Riskanalys'!L85=\"x\",\"x\",IF('5. Riskanalys'!M85<>\"\",\"x\",\"\"))","v":""}]
[{"$f":"'5. Riskanalys'!A86:A87","v":0},{"$f":"'5. Riskanalys'!#REF!","v":{"$error":"#REF!"}},{"$f":"'5. Riskanalys'!#REF!","v":{"$error":"#REF!"}},{"$f":"'5. Riskanalys'!#REF!","v":{"$error":"#REF!"}},{"$f":"'5. Riskanalys'!B86:B87","v":0},{"$f":"'5. Riskanalys'!C86","v":0},{"$f":"'5. Riskanalys'!D86:D87","v":0},{"$f":"'5. Riskanalys'!E86","v":0},{"$f":"'5. Riskanalys'!F86:F87","v":0},{"$f":"'5. Riskanalys'!G86","v":0},{"$f":"'5. Riskanalys'!H86","v":"Kvalitet"},{"$f":"'5. Riskanalys'!I86","v":{"$error":"#N/A"}},{"$f":"'5. Riskanalys'!J86","v":{"$error":"#N/A"}},{"$f":"'5. Riskanalys'!K86","v":{"$error":"#N/A"}},{"$f":"IF('5. Riskanalys'!L86=\"x\",\"x\",IF('5. Riskanalys'!M86<>\"\",\"x\",\"\"))","v":""}]
[null,null,null,null,null,{"$f":"'5. Riskanalys'!C87","v":0},null,{"$f":"'5. Riskanalys'!E87","v":0},null,{"$f":"'5. Riskanalys'!G87","v":0},{"$f":"'5. Riskanalys'!H87","v":"Leverans"},{"$f":"'5. Riskanalys'!I87","v":{"$error":"#N/A"}},{"$f":"'5. Riskanalys'!J87","v":{"$error":"#N/A"}},{"$f":"'5. Riskanalys'!K87","v":{"$error":"#N/A"}},{"$f":"IF('5. Riskanalys'!L87=\"x\",\"x\",IF('5. Riskanalys'!M87<>\"\",\"x\",\"\"))","v":""}]
[{"$f":"'5. Riskanalys'!A88:A89","v":0},{"$f":"'5. Riskanalys'!#REF!","v":{"$error":"#REF!"}},{"$f":"'5. Riskanalys'!#REF!","v":{"$error":"#REF!"}},{"$f":"'5. Riskanalys'!#REF!","v":{"$error":"#REF!"}},{"$f":"'5. Riskanalys'!B88:B89","v":0},{"$f":"'5. Riskanalys'!C88","v":0},{"$f":"'5. Riskanalys'!D88:D89","v":0},{"$f":"'5. Riskanalys'!E88","v":0},{"$f":"'5. Riskanalys'!F88:F89","v":0},{"$f":"'5. Riskanalys'!G88","v":0},{"$f":"'5. Riskanalys'!H88","v":"Kvalitet"},{"$f":"'5. Riskanalys'!I88","v":{"$error":"#N/A"}},{"$f":"'5. Riskanalys'!J88","v":{"$error":"#N/A"}},{"$f":"'5. Riskanalys'!K88","v":{"$error":"#N/A"}},{"$f":"IF('5. Riskanalys'!L88=\"x\",\"x\",IF('5. Riskanalys'!M88<>\"\",\"x\",\"\"))","v":""}]
[null,null,null,null,null,{"$f":"'5. Riskanalys'!C89","v":0},null,{"$f":"'5. Riskanalys'!E89","v":0},null,{"$f":"'5. Riskanalys'!G89","v":0},{"$f":"'5. Riskanalys'!H89","v":"Leverans"},{"$f":"'5. Riskanalys'!I89","v":{"$error":"#N/A"}},{"$f":"'5. Riskanalys'!J89","v":{"$error":"#N/A"}},{"$f":"'5. Riskanalys'!K89","v":{"$error":"#N/A"}},{"$f":"IF('5. Riskanalys'!L89=\"x\",\"x\",IF('5. Riskanalys'!M89<>\"\",\"x\",\"\"))","v":""}]
[{"$f":"'5. Riskanalys'!A90:A91","v":0},{"$f":"'5. Riskanalys'!#REF!","v":{"$error":"#REF!"}},{"$f":"'5. Riskanalys'!#REF!","v":{"$error":"#REF!"}},{"$f":"'5. Riskanalys'!#REF!","v":{"$error":"#REF!"}},{"$f":"'5. Riskanalys'!B90:B91","v":0},{"$f":"'5. Riskanalys'!C90","v":0},{"$f":"'5. Riskanalys'!D90:D91","v":0},{"$f":"'5. Riskanalys'!E90","v":0},{"$f":"'5. Riskanalys'!F90:F91","v":0},{"$f":"'5. Riskanalys'!G90","v":0},{"$f":"'5. Riskanalys'!H90","v":"Kvalitet"},{"$f":"'5. Riskanalys'!I90","v":{"$error":"#N/A"}},{"$f":"'5. Riskanalys'!J90","v":{"$error":"#N/A"}},{"$f":"'5. Riskanalys'!K90","v":{"$error":"#N/A"}},{"$f":"IF('5. Riskanalys'!L90=\"x\",\"x\",IF('5. Riskanalys'!M90<>\"\",\"x\",\"\"))","v":""}]
[null,null,null,null,null,{"$f":"'5. Riskanalys'!C91","v":0},null,{"$f":"'5. Riskanalys'!E91","v":0},null,{"$f":"'5. Riskanalys'!G91","v":0},{"$f":"'5. Riskanalys'!H91","v":"Leverans"},{"$f":"'5. Riskanalys'!I91","v":{"$error":"#N/A"}},{"$f":"'5. Riskanalys'!J91","v":{"$error":"#N/A"}},{"$f":"'5. Riskanalys'!K91","v":{"$error":"#N/A"}},{"$f":"IF('5. Riskanalys'!L91=\"x\",\"x\",IF('5. Riskanalys'!M91<>\"\",\"x\",\"\"))","v":""}]
[{"$f":"'5. Riskanalys'!A92:A93","v":0},{"$f":"'5. Riskanalys'!#REF!","v":{"$error":"#REF!"}},{"$f":"'5. Riskanalys'!#REF!","v":{"$error":"#REF!"}},{"$f":"'5. Riskanalys'!#REF!","v":{"$error":"#REF!"}},{"$f":"'5. Riskanalys'!B92:B93","v":0},{"$f":"'5. Riskanalys'!C92","v":0},{"$f":"'5. Riskanalys'!D92:D93","v":0},{"$f":"'5. Riskanalys'!E92","v":0},{"$f":"'5. Riskanalys'!F92:F93","v":0},{"$f":"'5. Riskanalys'!G92","v":0},{"$f":"'5. Riskanalys'!H92","v":"Kvalitet"},{"$f":"'5. Riskanalys'!I92","v":{"$error":"#N/A"}},{"$f":"'5. Riskanalys'!J92","v":{"$error":"#N/A"}},{"$f":"'5. Riskanalys'!K92","v":{"$error":"#N/A"}},{"$f":"IF('5. Riskanalys'!L92=\"x\",\"x\",IF('5. Riskanalys'!M92<>\"\",\"x\",\"\"))","v":""}]
[null,null,null,null,null,{"$f":"'5. Riskanalys'!C93","v":0},null,{"$f":"'5. Riskanalys'!E93","v":0},null,{"$f":"'5. Riskanalys'!G93","v":0},{"$f":"'5. Riskanalys'!H93","v":"Leverans"},{"$f":"'5. Riskanalys'!I93","v":{"$error":"#N/A"}},{"$f":"'5. Riskanalys'!J93","v":{"$error":"#N/A"}},{"$f":"'5. Riskanalys'!K93","v":{"$error":"#N/A"}},{"$f":"IF('5. Riskanalys'!L93=\"x\",\"x\",IF('5. Riskanalys'!M93<>\"\",\"x\",\"\"))","v":""}]
[{"$f":"'5. Riskanalys'!A94:A95","v":0},{"$f":"'5. Riskanalys'!#REF!","v":{"$error":"#REF!"}},{"$f":"'5. Riskanalys'!#REF!","v":{"$error":"#REF!"}},{"$f":"'5. Riskanalys'!#REF!","v":{"$error":"#REF!"}},{"$f":"'5. Riskanalys'!B94:B95","v":0},{"$f":"'5. Riskanalys'!C94","v":0},{"$f":"'5. Riskanalys'!D94:D95","v":0},{"$f":"'5. Riskanalys'!E94","v":0},{"$f":"'5. Riskanalys'!F94:F95","v":0},{"$f":"'5. Riskanalys'!G94","v":0},{"$f":"'5. Riskanalys'!H94","v":"Kvalitet"},{"$f":"'5. Riskanalys'!I94","v":{"$error":"#N/A"}},{"$f":"'5. Riskanalys'!J94","v":{"$error":"#N/A"}},{"$f":"'5. Riskanalys'!K94","v":{"$error":"#N/A"}},{"$f":"IF('5. Riskanalys'!L94=\"x\",\"x\",IF('5. Riskanalys'!M94<>\"\",\"x\",\"\"))","v":""}]
[null,null,null,null,null,{"$f":"'5. Riskanalys'!C95","v":0},null,{"$f":"'5. Riskanalys'!E95","v":0},null,{"$f":"'5. Riskanalys'!G95","v":0},{"$f":"'5. Riskanalys'!H95","v":"Leverans"},{"$f":"'5. Riskanalys'!I95","v":{"$error":"#N/A"}},{"$f":"'5. Riskanalys'!J95","v":{"$error":"#N/A"}},{"$f":"'5. Riskanalys'!K95","v":{"$error":"#N/A"}},{"$f":"IF('5. Riskanalys'!L95=\"x\",\"x\",IF('5. Riskanalys'!M95<>\"\",\"x\",\"\"))","v":""}]
[{"$f":"'5. Riskanalys'!A96:A97","v":0},{"$f":"'5. Riskanalys'!#REF!","v":{"$error":"#REF!"}},{"$f":"'5. Riskanalys'!#REF!","v":{"$error":"#REF!"}},{"$f":"'5. Riskanalys'!#REF!","v":{"$error":"#REF!"}},{"$f":"'5. Riskanalys'!B96:B97","v":0},{"$f":"'5. Riskanalys'!C96","v":0},{"$f":"'5. Riskanalys'!D96:D97","v":0},{"$f":"'5. Riskanalys'!E96","v":0},{"$f":"'5. Riskanalys'!F96:F97","v":0},{"$f":"'5. Riskanalys'!G96","v":0},{"$f":"'5. Riskanalys'!H96","v":"Kvalitet"},{"$f":"'5. Riskanalys'!I96","v":{"$error":"#N/A"}},{"$f":"'5. Riskanalys'!J96","v":{"$error":"#N/A"}},{"$f":"'5. Riskanalys'!K96","v":{"$error":"#N/A"}},{"$f":"IF('5. Riskanalys'!L96=\"x\",\"x\",IF('5. Riskanalys'!M96<>\"\",\"x\",\"\"))","v":""}]
[null,null,null,null,null,{"$f":"'5. Riskanalys'!C97","v":0},null,{"$f":"'5. Riskanalys'!E97","v":0},null,{"$f":"'5. Riskanalys'!G97","v":0},{"$f":"'5. Riskanalys'!H97","v":"Leverans"},{"$f":"'5. Riskanalys'!I97","v":{"$error":"#N/A"}},{"$f":"'5. Riskanalys'!J97","v":{"$error":"#N/A"}},{"$f":"'5. Riskanalys'!K97","v":{"$error":"#N/A"}},{"$f":"IF('5. Riskanalys'!L97=\"x\",\"x\",IF('5. Riskanalys'!M97<>\"\",\"x\",\"\"))","v":""}]
[{"$f":"'5. Riskanalys'!A98:A99","v":0},{"$f":"'5. Riskanalys'!#REF!","v":{"$error":"#REF!"}},{"$f":"'5. Riskanalys'!#REF!","v":{"$error":"#REF!"}},{"$f":"'5. Riskanalys'!#REF!","v":{"$error":"#REF!"}},{"$f":"'5. Riskanalys'!B98:B99","v":0},{"$f":"'5. Riskanalys'!C98","v":0},{"$f":"'5. Riskanalys'!D98:D99","v":0},{"$f":"'5. Riskanalys'!E98","v":0},{"$f":"'5. Riskanalys'!F98:F99","v":0},{"$f":"'5. Riskanalys'!G98","v":0},{"$f":"'5. Riskanalys'!H98","v":"Kvalitet"},{"$f":"'5. Riskanalys'!I98","v":{"$error":"#N/A"}},{"$f":"'5. Riskanalys'!J98","v":{"$error":"#N/A"}},{"$f":"'5. Riskanalys'!K98","v":{"$error":"#N/A"}},{"$f":"IF('5. Riskanalys'!L98=\"x\",\"x\",IF('5. Riskanalys'!M98<>\"\",\"x\",\"\"))","v":""}]
[null,null,null,null,null,{"$f":"'5. Riskanalys'!C99","v":0},null,{"$f":"'5. Riskanalys'!E99","v":0},null,{"$f":"'5. Riskanalys'!G99","v":0},{"$f":"'5. Riskanalys'!H99","v":"Leverans"},{"$f":"'5. Riskanalys'!I99","v":{"$error":"#N/A"}},{"$f":"'5. Riskanalys'!J99","v":{"$error":"#N/A"}},{"$f":"'5. Riskanalys'!K99","v":{"$error":"#N/A"}},{"$f":"IF('5. Riskanalys'!L99=\"x\",\"x\",IF('5. Riskanalys'!M99<>\"\",\"x\",\"\"))","v":""}]
[{"$f":"'5. Riskanalys'!A100:A101","v":0},{"$f":"'5. Riskanalys'!#REF!","v":{"$error":"#REF!"}},{"$f":"'5. Riskanalys'!#REF!","v":{"$error":"#REF!"}},{"$f":"'5. Riskanalys'!#REF!","v":{"$error":"#REF!"}},{"$f":"'5. Riskanalys'!B100:B101","v":0},{"$f":"'5. Riskanalys'!C100","v":0},{"$f":"'5. Riskanalys'!D100:D101","v":0},{"$f":"'5. Riskanalys'!E100","v":0},{"$f":"'5. Riskanalys'!F100:F101","v":0},{"$f":"'5. Riskanalys'!G100","v":0},{"$f":"'5. Riskanalys'!H100","v":"Kvalitet"},{"$f":"'5. Riskanalys'!I100","v":{"$error":"#N/A"}},{"$f":"'5. Riskanalys'!J100","v":{"$error":"#N/A"}},{"$f":"'5. Riskanalys'!K100","v":{"$error":"#N/A"}},{"$f":"IF('5. Riskanalys'!L100=\"x\",\"x\",IF('5. Riskanalys'!M100<>\"\",\"x\",\"\"))","v":""}]
[null,null,null,null,null,{"$f":"'5. Riskanalys'!C101","v":0},null,{"$f":"'5. Riskanalys'!E101","v":0},null,{"$f":"'5. Riskanalys'!G101","v":0},{"$f":"'5. Riskanalys'!H101","v":"Leverans"},{"$f":"'5. Riskanalys'!I101","v":{"$error":"#N/A"}},{"$f":"'5. Riskanalys'!J101","v":{"$error":"#N/A"}},{"$f":"'5. Riskanalys'!K101","v":{"$error":"#N/A"}},{"$f":"IF('5. Riskanalys'!L101=\"x\",\"x\",IF('5. Riskanalys'!M101<>\"\",\"x\",\"\"))","v":""}]
[{"$f":"'5. Riskanalys'!A102:A103","v":"Försämrad vattenkvalitet som leder till att nuvarande reningsprocess blir otillräcklig."},{"$f":"'5. Riskanalys'!#REF!","v":{"$error":"#REF!"}},{"$f":"'5. Riskanalys'!#REF!","v":{"$error":"#REF!"}},{"$f":"'5. Riskanalys'!#REF!","v":{"$error":"#REF!"}},{"$f":"'5. Riskanalys'!B102:B103","v":1},{"$f":"'5. Riskanalys'!C102","v":2},{"$f":"'5. Riskanalys'!D102:D103","v":1},{"$f":"'5. Riskanalys'!E102","v":2},{"$f":"'5. Riskanalys'!F102:F103","v":2},{"$f":"'5. Riskanalys'!G102","v":2},{"$f":"'5. Riskanalys'!H102","v":"Kvalitet"},{"$f":"'5. Riskanalys'!I102","v":5},{"$f":"'5. Riskanalys'!J102","v":5},{"$f":"'5. Riskanalys'!K102","v":10},{"$f":"IF('5. Riskanalys'!L102=\"x\",\"x\",IF('5. Riskanalys'!M102<>\"\",\"x\",\"\"))","v":""}]
[null,null,null,null,null,{"$f":"'5. Riskanalys'!C103","v":1},null,{"$f":"'5. Riskanalys'!E103","v":1},null,{"$f":"'5. Riskanalys'!G103","v":1},{"$f":"'5. Riskanalys'!H103","v":"Leverans"},{"$f":"'5. Riskanalys'!I103","v":1},{"$f":"'5. Riskanalys'!J103","v":1},{"$f":"'5. Riskanalys'!K103","v":2},{"$f":"IF('5. Riskanalys'!L103=\"x\",\"x\",IF('5. Riskanalys'!M103<>\"\",\"x\",\"\"))","v":""}]
[{"$f":"'5. Riskanalys'!A104:A105","v":0},{"$f":"'5. Riskanalys'!#REF!","v":{"$error":"#REF!"}},{"$f":"'5. Riskanalys'!#REF!","v":{"$error":"#REF!"}},{"$f":"'5. Riskanalys'!#REF!","v":{"$error":"#REF!"}},{"$f":"'5. Riskanalys'!B104:B105","v":0},{"$f":"'5. Riskanalys'!C104","v":0},{"$f":"'5. Riskanalys'!D104:D105","v":0},{"$f":"'5. Riskanalys'!E104","v":0},{"$f":"'5. Riskanalys'!F104:F105","v":0},{"$f":"'5. Riskanalys'!G104","v":0},{"$f":"'5. Riskanalys'!H104","v":"Kvalitet"},{"$f":"'5. Riskanalys'!I104","v":{"$error":"#N/A"}},{"$f":"'5. Riskanalys'!J104","v":{"$error":"#N/A"}},{"$f":"'5. Riskanalys'!K104","v":{"$error":"#N/A"}},{"$f":"IF('5. Riskanalys'!L104=\"x\",\"x\",IF('5. Riskanalys'!M104<>\"\",\"x\",\"\"))","v":""}]
[null,null,null,null,null,{"$f":"'5. Riskanalys'!C105","v":0},null,{"$f":"'5. Riskanalys'!E105","v":0},null,{"$f":"'5. Riskanalys'!G105","v":0},{"$f":"'5. Riskanalys'!H105","v":"Leverans"},{"$f":"'5. Riskanalys'!I105","v":{"$error":"#N/A"}},{"$f":"'5. Riskanalys'!J105","v":{"$error":"#N/A"}},{"$f":"'5. Riskanalys'!K105","v":{"$error":"#N/A"}},{"$f":"IF('5. Riskanalys'!L105=\"x\",\"x\",IF('5. Riskanalys'!M105<>\"\",\"x\",\"\"))","v":""}]
[{"$f":"'5. Riskanalys'!A106:A107","v":0},{"$f":"'5. Riskanalys'!#REF!","v":{"$error":"#REF!"}},{"$f":"'5. Riskanalys'!#REF!","v":{"$error":"#REF!"}},{"$f":"'5. Riskanalys'!#REF!","v":{"$error":"#REF!"}},{"$f":"'5. Riskanalys'!B106:B107","v":0},{"$f":"'5. Riskanalys'!C106","v":0},{"$f":"'5. Riskanalys'!D106:D107","v":0},{"$f":"'5. Riskanalys'!E106","v":0},{"$f":"'5. Riskanalys'!F106:F107","v":0},{"$f":"'5. Riskanalys'!G106","v":0},{"$f":"'5. Riskanalys'!H106","v":"Kvalitet"},{"$f":"'5. Riskanalys'!I106","v":{"$error":"#N/A"}},{"$f":"'5. Riskanalys'!J106","v":{"$error":"#N/A"}},{"$f":"'5. Riskanalys'!K106","v":{"$error":"#N/A"}},{"$f":"IF('5. Riskanalys'!L106=\"x\",\"x\",IF('5. Riskanalys'!M106<>\"\",\"x\",\"\"))","v":""}]
[null,null,null,null,null,{"$f":"'5. Riskanalys'!C107","v":0},null,{"$f":"'5. Riskanalys'!E107","v":0},null,{"$f":"'5. Riskanalys'!G107","v":0},{"$f":"'5. Riskanalys'!H107","v":"Leverans"},{"$f":"'5. Riskanalys'!I107","v":{"$error":"#N/A"}},{"$f":"'5. Riskanalys'!J107","v":{"$error":"#N/A"}},{"$f":"'5. Riskanalys'!K107","v":{"$error":"#N/A"}},{"$f":"IF('5. Riskanalys'!L107=\"x\",\"x\",IF('5. Riskanalys'!M107<>\"\",\"x\",\"\"))","v":""}]
[{"$f":"'5. Riskanalys'!A108:A109","v":0},{"$f":"'5. Riskanalys'!#REF!","v":{"$error":"#REF!"}},{"$f":"'5. Riskanalys'!#REF!","v":{"$error":"#REF!"}},{"$f":"'5. Riskanalys'!#REF!","v":{"$error":"#REF!"}},{"$f":"'5. Riskanalys'!B108:B109","v":0},{"$f":"'5. Riskanalys'!C108","v":0},{"$f":"'5. Riskanalys'!D108:D109","v":0},{"$f":"'5. Riskanalys'!E108","v":0},{"$f":"'5. Riskanalys'!F108:F109","v":0},{"$f":"'5. Riskanalys'!G108","v":0},{"$f":"'5. Riskanalys'!H108","v":"Kvalitet"},{"$f":"'5. Riskanalys'!I108","v":{"$error":"#N/A"}},{"$f":"'5. Riskanalys'!J108","v":{"$error":"#N/A"}},{"$f":"'5. Riskanalys'!K108","v":{"$error":"#N/A"}},{"$f":"IF('5. Riskanalys'!L108=\"x\",\"x\",IF('5. Riskanalys'!M108<>\"\",\"x\",\"\"))","v":""}]
[null,null,null,null,null,{"$f":"'5. Riskanalys'!C109","v":0},null,{"$f":"'5. Riskanalys'!E109","v":0},null,{"$f":"'5. Riskanalys'!G109","v":0},{"$f":"'5. Riskanalys'!H109","v":"Leverans"},{"$f":"'5. Riskanalys'!I109","v":{"$error":"#N/A"}},{"$f":"'5. Riskanalys'!J109","v":{"$error":"#N/A"}},{"$f":"'5. Riskanalys'!K109","v":{"$error":"#N/A"}},{"$f":"IF('5. Riskanalys'!L109=\"x\",\"x\",IF('5. Riskanalys'!M109<>\"\",\"x\",\"\"))","v":""}]
[{"$f":"'5. Riskanalys'!A110:A111","v":0},{"$f":"'5. Riskanalys'!#REF!","v":{"$error":"#REF!"}},{"$f":"'5. Riskanalys'!#REF!","v":{"$error":"#REF!"}},{"$f":"'5. Riskanalys'!#REF!","v":{"$error":"#REF!"}},{"$f":"'5. Riskanalys'!B110:B111","v":0},{"$f":"'5. Riskanalys'!C110","v":0},{"$f":"'5. Riskanalys'!D110:D111","v":0},{"$f":"'5. Riskanalys'!E110","v":0},{"$f":"'5. Riskanalys'!F110:F111","v":0},{"$f":"'5. Riskanalys'!G110","v":0},{"$f":"'5. Riskanalys'!H110","v":"Kvalitet"},{"$f":"'5. Riskanalys'!I110","v":{"$error":"#N/A"}},{"$f":"'5. Riskanalys'!J110","v":{"$error":"#N/A"}},{"$f":"'5. Riskanalys'!K110","v":{"$error":"#N/A"}},{"$f":"IF('5. Riskanalys'!L110=\"x\",\"x\",IF('5. Riskanalys'!M110<>\"\",\"x\",\"\"))","v":""}]
[null,null,null,null,null,{"$f":"'5. Riskanalys'!C111","v":0},null,{"$f":"'5. Riskanalys'!E111","v":0},null,{"$f":"'5. Riskanalys'!G111","v":0},{"$f":"'5. Riskanalys'!H111","v":"Leverans"},{"$f":"'5. Riskanalys'!I111","v":{"$error":"#N/A"}},{"$f":"'5. Riskanalys'!J111","v":{"$error":"#N/A"}},{"$f":"'5. Riskanalys'!K111","v":{"$error":"#N/A"}},{"$f":"IF('5. Riskanalys'!L111=\"x\",\"x\",IF('5. Riskanalys'!M111<>\"\",\"x\",\"\"))","v":""}]
[{"$f":"'5. Riskanalys'!A112:A113","v":0},{"$f":"'5. Riskanalys'!#REF!","v":{"$error":"#REF!"}},{"$f":"'5. Riskanalys'!#REF!","v":{"$error":"#REF!"}},{"$f":"'5. Riskanalys'!#REF!","v":{"$error":"#REF!"}},{"$f":"'5. Riskanalys'!B112:B113","v":0},{"$f":"'5. Riskanalys'!C112","v":0},{"$f":"'5. Riskanalys'!D112:D113","v":0},{"$f":"'5. Riskanalys'!E112","v":0},{"$f":"'5. Riskanalys'!F112:F113","v":0},{"$f":"'5. Riskanalys'!G112","v":0},{"$f":"'5. Riskanalys'!H112","v":"Kvalitet"},{"$f":"'5. Riskanalys'!I112","v":{"$error":"#N/A"}},{"$f":"'5. Riskanalys'!J112","v":{"$error":"#N/A"}},{"$f":"'5. Riskanalys'!K112","v":{"$error":"#N/A"}},{"$f":"IF('5. Riskanalys'!L112=\"x\",\"x\",IF('5. Riskanalys'!M112<>\"\",\"x\",\"\"))","v":""}]
[null,null,null,null,null,{"$f":"'5. Riskanalys'!C113","v":0},null,{"$f":"'5. Riskanalys'!E113","v":0},null,{"$f":"'5. Riskanalys'!G113","v":0},{"$f":"'5. Riskanalys'!H113","v":"Leverans"},{"$f":"'5. Riskanalys'!I113","v":{"$error":"#N/A"}},{"$f":"'5. Riskanalys'!J113","v":{"$error":"#N/A"}},{"$f":"'5. Riskanalys'!K113","v":{"$error":"#N/A"}},{"$f":"IF('5. Riskanalys'!L113=\"x\",\"x\",IF('5. Riskanalys'!M113<>\"\",\"x\",\"\"))","v":""}]
[{"$f":"'5. Riskanalys'!A114:A115","v":0},{"$f":"'5. Riskanalys'!#REF!","v":{"$error":"#REF!"}},{"$f":"'5. Riskanalys'!#REF!","v":{"$error":"#REF!"}},{"$f":"'5. Riskanalys'!#REF!","v":{"$error":"#REF!"}},{"$f":"'5. Riskanalys'!B114:B115","v":0},{"$f":"'5. Riskanalys'!C114","v":0},{"$f":"'5. Riskanalys'!D114:D115","v":0},{"$f":"'5. Riskanalys'!E114","v":0},{"$f":"'5. Riskanalys'!F114:F115","v":0},{"$f":"'5. Riskanalys'!G114","v":0},{"$f":"'5. Riskanalys'!H114","v":"Kvalitet"},{"$f":"'5. Riskanalys'!I114","v":{"$error":"#N/A"}},{"$f":"'5. Riskanalys'!J114","v":{"$error":"#N/A"}},{"$f":"'5. Riskanalys'!K114","v":{"$error":"#N/A"}},{"$f":"IF('5. Riskanalys'!L114=\"x\",\"x\",IF('5. Riskanalys'!M114<>\"\",\"x\",\"\"))","v":""}]
[null,null,null,null,null,{"$f":"'5. Riskanalys'!C115","v":0},null,{"$f":"'5. Riskanalys'!E115","v":0},null,{"$f":"'5. Riskanalys'!G115","v":0},{"$f":"'5. Riskanalys'!H115","v":"Leverans"},{"$f":"'5. Riskanalys'!I115","v":{"$error":"#N/A"}},{"$f":"'5. Riskanalys'!J115","v":{"$error":"#N/A"}},{"$f":"'5. Riskanalys'!K115","v":{"$error":"#N/A"}},{"$f":"IF('5. Riskanalys'!L115=\"x\",\"x\",IF('5. Riskanalys'!M115<>\"\",\"x\",\"\"))","v":""}]
[{"$f":"'5. Riskanalys'!A116:A117","v":0},{"$f":"'5. Riskanalys'!#REF!","v":{"$error":"#REF!"}},{"$f":"'5. Riskanalys'!#REF!","v":{"$error":"#REF!"}},{"$f":"'5. Riskanalys'!#REF!","v":{"$error":"#REF!"}},{"$f":"'5. Riskanalys'!B116:B117","v":0},{"$f":"'5. Riskanalys'!C116","v":0},{"$f":"'5. Riskanalys'!D116:D117","v":0},{"$f":"'5. Riskanalys'!E116","v":0},{"$f":"'5. Riskanalys'!F116:F117","v":0},{"$f":"'5. Riskanalys'!G116","v":0},{"$f":"'5. Riskanalys'!H116","v":"Kvalitet"},{"$f":"'5. Riskanalys'!I116","v":{"$error":"#N/A"}},{"$f":"'5. Riskanalys'!J116","v":{"$error":"#N/A"}},{"$f":"'5. Riskanalys'!K116","v":{"$error":"#N/A"}},{"$f":"IF('5. Riskanalys'!L116=\"x\",\"x\",IF('5. Riskanalys'!M116<>\"\",\"x\",\"\"))","v":""}]
[null,null,null,null,null,{"$f":"'5. Riskanalys'!C117","v":0},null,{"$f":"'5. Riskanalys'!E117","v":0},null,{"$f":"'5. Riskanalys'!G117","v":0},{"$f":"'5. Riskanalys'!H117","v":"Leverans"},{"$f":"'5. Riskanalys'!I117","v":{"$error":"#N/A"}},{"$f":"'5. Riskanalys'!J117","v":{"$error":"#N/A"}},{"$f":"'5. Riskanalys'!K117","v":{"$error":"#N/A"}},{"$f":"IF('5. Riskanalys'!L117=\"x\",\"x\",IF('5. Riskanalys'!M117<>\"\",\"x\",\"\"))","v":""}]
[{"$f":"'5. Riskanalys'!A118:A119","v":0},{"$f":"'5. Riskanalys'!#REF!","v":{"$error":"#REF!"}},{"$f":"'5. Riskanalys'!#REF!","v":{"$error":"#REF!"}},{"$f":"'5. Riskanalys'!#REF!","v":{"$error":"#REF!"}},{"$f":"'5. Riskanalys'!B118:B119","v":0},{"$f":"'5. Riskanalys'!C118","v":0},{"$f":"'5. Riskanalys'!D118:D119","v":0},{"$f":"'5. Riskanalys'!E118","v":0},{"$f":"'5. Riskanalys'!F118:F119","v":0},{"$f":"'5. Riskanalys'!G118","v":0},{"$f":"'5. Riskanalys'!H118","v":"Kvalitet"},{"$f":"'5. Riskanalys'!I118","v":{"$error":"#N/A"}},{"$f":"'5. Riskanalys'!J118","v":{"$error":"#N/A"}},{"$f":"'5. Riskanalys'!K118","v":{"$error":"#N/A"}},{"$f":"IF('5. Riskanalys'!L118=\"x\",\"x\",IF('5. Riskanalys'!M118<>\"\",\"x\",\"\"))","v":""}]
[null,null,null,null,null,{"$f":"'5. Riskanalys'!C119","v":0},null,{"$f":"'5. Riskanalys'!E119","v":0},null,{"$f":"'5. Riskanalys'!G119","v":0},{"$f":"'5. Riskanalys'!H119","v":"Leverans"},{"$f":"'5. Riskanalys'!I119","v":{"$error":"#N/A"}},{"$f":"'5. Riskanalys'!J119","v":{"$error":"#N/A"}},{"$f":"'5. Riskanalys'!K119","v":{"$error":"#N/A"}},{"$f":"IF('5. Riskanalys'!L119=\"x\",\"x\",IF('5. Riskanalys'!M119<>\"\",\"x\",\"\"))","v":""}]
[{"$f":"'5. Riskanalys'!A120:A121","v":0},{"$f":"'5. Riskanalys'!#REF!","v":{"$error":"#REF!"}},{"$f":"'5. Riskanalys'!#REF!","v":{"$error":"#REF!"}},{"$f":"'5. Riskanalys'!#REF!","v":{"$error":"#REF!"}},{"$f":"'5. Riskanalys'!B120:B121","v":0},{"$f":"'5. Riskanalys'!C120","v":0},{"$f":"'5. Riskanalys'!D120:D121","v":0},{"$f":"'5. Riskanalys'!E120","v":0},{"$f":"'5. Riskanalys'!F120:F121","v":0},{"$f":"'5. Riskanalys'!G120","v":0},{"$f":"'5. Riskanalys'!H120","v":"Kvalitet"},{"$f":"'5. Riskanalys'!I120","v":{"$error":"#N/A"}},{"$f":"'5. Riskanalys'!J120","v":{"$error":"#N/A"}},{"$f":"'5. Riskanalys'!K120","v":{"$error":"#N/A"}},{"$f":"IF('5. Riskanalys'!L120=\"x\",\"x\",IF('5. Riskanalys'!M120<>\"\",\"x\",\"\"))","v":""}]
[null,null,null,null,null,{"$f":"'5. Riskanalys'!C121","v":0},null,{"$f":"'5. Riskanalys'!E121","v":0},null,{"$f":"'5. Riskanalys'!G121","v":0},{"$f":"'5. Riskanalys'!H121","v":"Leverans"},{"$f":"'5. Riskanalys'!I121","v":{"$error":"#N/A"}},{"$f":"'5. Riskanalys'!J121","v":{"$error":"#N/A"}},{"$f":"'5. Riskanalys'!K121","v":{"$error":"#N/A"}},{"$f":"IF('5. Riskanalys'!L121=\"x\",\"x\",IF('5. Riskanalys'!M121<>\"\",\"x\",\"\"))","v":""}]
[{"$f":"'5. Riskanalys'!A122:A123","v":0},{"$f":"'5. Riskanalys'!#REF!","v":{"$error":"#REF!"}},{"$f":"'5. Riskanalys'!#REF!","v":{"$error":"#REF!"}},{"$f":"'5. Riskanalys'!#REF!","v":{"$error":"#REF!"}},{"$f":"'5. Riskanalys'!B122:B123","v":0},{"$f":"'5. Riskanalys'!C122","v":0},{"$f":"'5. Riskanalys'!D122:D123","v":0},{"$f":"'5. Riskanalys'!E122","v":0},{"$f":"'5. Riskanalys'!F122:F123","v":0},{"$f":"'5. Riskanalys'!G122","v":0},{"$f":"'5. Riskanalys'!H122","v":"Kvalitet"},{"$f":"'5. Riskanalys'!I122","v":{"$error":"#N/A"}},{"$f":"'5. Riskanalys'!J122","v":{"$error":"#N/A"}},{"$f":"'5. Riskanalys'!K122","v":{"$error":"#N/A"}},{"$f":"IF('5. Riskanalys'!L122=\"x\",\"x\",IF('5. Riskanalys'!M122<>\"\",\"x\",\"\"))","v":""}]
[null,null,null,null,null,{"$f":"'5. Riskanalys'!C123","v":0},null,{"$f":"'5. Riskanalys'!E123","v":0},null,{"$f":"'5. Riskanalys'!G123","v":0},{"$f":"'5. Riskanalys'!H123","v":"Leverans"},{"$f":"'5. Riskanalys'!I123","v":{"$error":"#N/A"}},{"$f":"'5. Riskanalys'!J123","v":{"$error":"#N/A"}},{"$f":"'5. Riskanalys'!K123","v":{"$error":"#N/A"}},{"$f":"IF('5. Riskanalys'!L123=\"x\",\"x\",IF('5. Riskanalys'!M123<>\"\",\"x\",\"\"))","v":""}]
[{"$f":"'5. Riskanalys'!A124:A125","v":0},{"$f":"'5. Riskanalys'!#REF!","v":{"$error":"#REF!"}},{"$f":"'5. Riskanalys'!#REF!","v":{"$error":"#REF!"}},{"$f":"'5. Riskanalys'!#REF!","v":{"$error":"#REF!"}},{"$f":"'5. Riskanalys'!B124:B125","v":0},{"$f":"'5. Riskanalys'!C124","v":0},{"$f":"'5. Riskanalys'!D124:D125","v":0},{"$f":"'5. Riskanalys'!E124","v":0},{"$f":"'5. Riskanalys'!F124:F125","v":0},{"$f":"'5. Riskanalys'!G124","v":0},{"$f":"'5. Riskanalys'!H124","v":"Kvalitet"},{"$f":"'5. Riskanalys'!I124","v":{"$error":"#N/A"}},{"$f":"'5. Riskanalys'!J124","v":{"$error":"#N/A"}},{"$f":"'5. Riskanalys'!K124","v":{"$error":"#N/A"}},{"$f":"IF('5. Riskanalys'!L124=\"x\",\"x\",IF('5. Riskanalys'!M124<>\"\",\"x\",\"\"))","v":""}]
[null,null,null,null,null,{"$f":"'5. Riskanalys'!C125","v":0},null,{"$f":"'5. Riskanalys'!E125","v":0},null,{"$f":"'5. Riskanalys'!G125","v":0},{"$f":"'5. Riskanalys'!H125","v":"Leverans"},{"$f":"'5. Riskanalys'!I125","v":{"$error":"#N/A"}},{"$f":"'5. Riskanalys'!J125","v":{"$error":"#N/A"}},{"$f":"'5. Riskanalys'!K125","v":{"$error":"#N/A"}},{"$f":"IF('5. Riskanalys'!L125=\"x\",\"x\",IF('5. Riskanalys'!M125<>\"\",\"x\",\"\"))","v":""}]
[{"$f":"'5. Riskanalys'!A126:A127","v":0},{"$f":"'5. Riskanalys'!#REF!","v":{"$error":"#REF!"}},{"$f":"'5. Riskanalys'!#REF!","v":{"$error":"#REF!"}},{"$f":"'5. Riskanalys'!#REF!","v":{"$error":"#REF!"}},{"$f":"'5. Riskanalys'!B126:B127","v":0},{"$f":"'5. Riskanalys'!C126","v":0},{"$f":"'5. Riskanalys'!D126:D127","v":0},{"$f":"'5. Riskanalys'!E126","v":0},{"$f":"'5. Riskanalys'!F126:F127","v":0},{"$f":"'5. Riskanalys'!G126","v":0},{"$f":"'5. Riskanalys'!H126","v":"Kvalitet"},{"$f":"'5. Riskanalys'!I126","v":{"$error":"#N/A"}},{"$f":"'5. Riskanalys'!J126","v":{"$error":"#N/A"}},{"$f":"'5. Riskanalys'!K126","v":{"$error":"#N/A"}},{"$f":"IF('5. Riskanalys'!L126=\"x\",\"x\",IF('5. Riskanalys'!M126<>\"\",\"x\",\"\"))","v":""}]
[null,null,null,null,null,{"$f":"'5. Riskanalys'!C127","v":0},null,{"$f":"'5. Riskanalys'!E127","v":0},null,{"$f":"'5. Riskanalys'!G127","v":0},{"$f":"'5. Riskanalys'!H127","v":"Leverans"},{"$f":"'5. Riskanalys'!I127","v":{"$error":"#N/A"}},{"$f":"'5. Riskanalys'!J127","v":{"$error":"#N/A"}},{"$f":"'5. Riskanalys'!K127","v":{"$error":"#N/A"}},{"$f":"IF('5. Riskanalys'!L127=\"x\",\"x\",IF('5. Riskanalys'!M127<>\"\",\"x\",\"\"))","v":""}]
[{"$f":"'5. Riskanalys'!A128:A129","v":"Översvämning av tryckstegringsstationerna 56 och 32 som leder till fysisk påverkan på anläggningarna.  "},{"$f":"'5. Riskanalys'!#REF!","v":{"$error":"#REF!"}},{"$f":"'5. Riskanalys'!#REF!","v":{"$error":"#REF!"}},{"$f":"'5. Riskanalys'!#REF!","v":{"$error":"#REF!"}},{"$f":"'5. Riskanalys'!B128:B129","v":1},{"$f":"'5. Riskanalys'!C128","v":1},{"$f":"'5. Riskanalys'!D128:D129","v":1},{"$f":"'5. Riskanalys'!E128","v":1},{"$f":"'5. Riskanalys'!F128:F129","v":1},{"$f":"'5. Riskanalys'!G128","v":1},{"$f":"'5. Riskanalys'!H128","v":"Kvalitet"},{"$f":"'5. Riskanalys'!I128","v":1},{"$f":"'5. Riskanalys'!J128","v":1},{"$f":"'5. Riskanalys'!K128","v":1},{"$f":"IF('5. Riskanalys'!L128=\"x\",\"x\",IF('5. Riskanalys'!M128<>\"\",\"x\",\"\"))","v":""}]
[null,null,null,null,null,{"$f":"'5. Riskanalys'!C129","v":2},null,{"$f":"'5. Riskanalys'!E129","v":2},null,{"$f":"'5. Riskanalys'!G129","v":2},{"$f":"'5. Riskanalys'!H129","v":"Leverans"},{"$f":"'5. Riskanalys'!I129","v":5},{"$f":"'5. Riskanalys'!J129","v":5},{"$f":"'5. Riskanalys'!K129","v":5},{"$f":"IF('5. Riskanalys'!L129=\"x\",\"x\",IF('5. Riskanalys'!M129<>\"\",\"x\",\"\"))","v":""}]
[{"$f":"'5. Riskanalys'!A130:A131","v":0},{"$f":"'5. Riskanalys'!#REF!","v":{"$error":"#REF!"}},{"$f":"'5. Riskanalys'!#REF!","v":{"$error":"#REF!"}},{"$f":"'5. Riskanalys'!#REF!","v":{"$error":"#REF!"}},{"$f":"'5. Riskanalys'!B130:B131","v":0},{"$f":"'5. Riskanalys'!C130","v":0},{"$f":"'5. Riskanalys'!D130:D131","v":0},{"$f":"'5. Riskanalys'!E130","v":0},{"$f":"'5. Riskanalys'!F130:F131","v":0},{"$f":"'5. Riskanalys'!G130","v":0},{"$f":"'5. Riskanalys'!H130","v":"Kvalitet"},{"$f":"'5. Riskanalys'!I130","v":{"$error":"#N/A"}},{"$f":"'5. Riskanalys'!J130","v":{"$error":"#N/A"}},{"$f":"'5. Riskanalys'!K130","v":{"$error":"#N/A"}},{"$f":"IF('5. Riskanalys'!L130=\"x\",\"x\",IF('5. Riskanalys'!M130<>\"\",\"x\",\"\"))","v":""}]
[null,null,null,null,null,{"$f":"'5. Riskanalys'!C131","v":0},null,{"$f":"'5. Riskanalys'!E131","v":0},null,{"$f":"'5. Riskanalys'!G131","v":0},{"$f":"'5. Riskanalys'!H131","v":"Leverans"},{"$f":"'5. Riskanalys'!I131","v":{"$error":"#N/A"}},{"$f":"'5. Riskanalys'!J131","v":{"$error":"#N/A"}},{"$f":"'5. Riskanalys'!K131","v":{"$error":"#N/A"}},{"$f":"IF('5. Riskanalys'!L131=\"x\",\"x\",IF('5. Riskanalys'!M131<>\"\",\"x\",\"\"))","v":""}]
[{"$f":"'5. Riskanalys'!A132:A133","v":0},{"$f":"'5. Riskanalys'!#REF!","v":{"$error":"#REF!"}},{"$f":"'5. Riskanalys'!#REF!","v":{"$error":"#REF!"}},{"$f":"'5. Riskanalys'!#REF!","v":{"$error":"#REF!"}},{"$f":"'5. Riskanalys'!B132:B133","v":0},{"$f":"'5. Riskanalys'!C132","v":0},{"$f":"'5. Riskanalys'!D132:D133","v":0},{"$f":"'5. Riskanalys'!E132","v":0},{"$f":"'5. Riskanalys'!F132:F133","v":0},{"$f":"'5. Riskanalys'!G132","v":0},{"$f":"'5. Riskanalys'!H132","v":"Kvalitet"},{"$f":"'5. Riskanalys'!I132","v":{"$error":"#N/A"}},{"$f":"'5. Riskanalys'!J132","v":{"$error":"#N/A"}},{"$f":"'5. Riskanalys'!K132","v":{"$error":"#N/A"}},{"$f":"IF('5. Riskanalys'!L132=\"x\",\"x\",IF('5. Riskanalys'!M132<>\"\",\"x\",\"\"))","v":""}]
[null,null,null,null,null,{"$f":"'5. Riskanalys'!C133","v":0},null,{"$f":"'5. Riskanalys'!E133","v":0},null,{"$f":"'5. Riskanalys'!G133","v":0},{"$f":"'5. Riskanalys'!H133","v":"Leverans"},{"$f":"'5. Riskanalys'!I133","v":{"$error":"#N/A"}},{"$f":"'5. Riskanalys'!J133","v":{"$error":"#N/A"}},{"$f":"'5. Riskanalys'!K133","v":{"$error":"#N/A"}},{"$f":"IF('5. Riskanalys'!L133=\"x\",\"x\",IF('5. Riskanalys'!M133<>\"\",\"x\",\"\"))","v":""}]
[{"$f":"'5. Riskanalys'!A134:A135","v":0},{"$f":"'5. Riskanalys'!#REF!","v":{"$error":"#REF!"}},{"$f":"'5. Riskanalys'!#REF!","v":{"$error":"#REF!"}},{"$f":"'5. Riskanalys'!#REF!","v":{"$error":"#REF!"}},{"$f":"'5. Riskanalys'!B134:B135","v":0},{"$f":"'5. Riskanalys'!C134","v":0},{"$f":"'5. Riskanalys'!D134:D135","v":0},{"$f":"'5. Riskanalys'!E134","v":0},{"$f":"'5. Riskanalys'!F134:F135","v":0},{"$f":"'5. Riskanalys'!G134","v":0},{"$f":"'5. Riskanalys'!H134","v":"Kvalitet"},{"$f":"'5. Riskanalys'!I134","v":{"$error":"#N/A"}},{"$f":"'5. Riskanalys'!J134","v":{"$error":"#N/A"}},{"$f":"'5. Riskanalys'!K134","v":{"$error":"#N/A"}},{"$f":"IF('5. Riskanalys'!L134=\"x\",\"x\",IF('5. Riskanalys'!M134<>\"\",\"x\",\"\"))","v":""}]
[null,null,null,null,null,{"$f":"'5. Riskanalys'!C135","v":0},null,{"$f":"'5. Riskanalys'!E135","v":0},null,{"$f":"'5. Riskanalys'!G135","v":0},{"$f":"'5. Riskanalys'!H135","v":"Leverans"},{"$f":"'5. Riskanalys'!I135","v":{"$error":"#N/A"}},{"$f":"'5. Riskanalys'!J135","v":{"$error":"#N/A"}},{"$f":"'5. Riskanalys'!K135","v":{"$error":"#N/A"}},{"$f":"IF('5. Riskanalys'!L135=\"x\",\"x\",IF('5. Riskanalys'!M135<>\"\",\"x\",\"\"))","v":""}]
[{"$f":"'5. Riskanalys'!A136:A137","v":0},{"$f":"'5. Riskanalys'!#REF!","v":{"$error":"#REF!"}},{"$f":"'5. Riskanalys'!#REF!","v":{"$error":"#REF!"}},{"$f":"'5. Riskanalys'!#REF!","v":{"$error":"#REF!"}},{"$f":"'5. Riskanalys'!B136:B137","v":0},{"$f":"'5. Riskanalys'!C136","v":0},{"$f":"'5. Riskanalys'!D136:D137","v":0},{"$f":"'5. Riskanalys'!E136","v":0},{"$f":"'5. Riskanalys'!F136:F137","v":0},{"$f":"'5. Riskanalys'!G136","v":0},{"$f":"'5. Riskanalys'!H136","v":"Kvalitet"},{"$f":"'5. Riskanalys'!I136","v":{"$error":"#N/A"}},{"$f":"'5. Riskanalys'!J136","v":{"$error":"#N/A"}},{"$f":"'5. Riskanalys'!K136","v":{"$error":"#N/A"}},{"$f":"IF('5. Riskanalys'!L136=\"x\",\"x\",IF('5. Riskanalys'!M136<>\"\",\"x\",\"\"))","v":""}]
[null,null,null,null,null,{"$f":"'5. Riskanalys'!C137","v":0},null,{"$f":"'5. Riskanalys'!E137","v":0},null,{"$f":"'5. Riskanalys'!G137","v":0},{"$f":"'5. Riskanalys'!H137","v":"Leverans"},{"$f":"'5. Riskanalys'!I137","v":{"$error":"#N/A"}},{"$f":"'5. Riskanalys'!J137","v":{"$error":"#N/A"}},{"$f":"'5. Riskanalys'!K137","v":{"$error":"#N/A"}},{"$f":"IF('5. Riskanalys'!L137=\"x\",\"x\",IF('5. Riskanalys'!M137<>\"\",\"x\",\"\"))","v":""}]
[{"$f":"'5. Riskanalys'!A138:A139","v":0},{"$f":"'5. Riskanalys'!#REF!","v":{"$error":"#REF!"}},{"$f":"'5. Riskanalys'!#REF!","v":{"$error":"#REF!"}},{"$f":"'5. Riskanalys'!#REF!","v":{"$error":"#REF!"}},{"$f":"'5. Riskanalys'!B138:B139","v":0},{"$f":"'5. Riskanalys'!C138","v":0},{"$f":"'5. Riskanalys'!D138:D139","v":0},{"$f":"'5. Riskanalys'!E138","v":0},{"$f":"'5. Riskanalys'!F138:F139","v":0},{"$f":"'5. Riskanalys'!G138","v":0},{"$f":"'5. Riskanalys'!H138","v":"Kvalitet"},{"$f":"'5. Riskanalys'!I138","v":{"$error":"#N/A"}},{"$f":"'5. Riskanalys'!J138","v":{"$error":"#N/A"}},{"$f":"'5. Riskanalys'!K138","v":{"$error":"#N/A"}},{"$f":"IF('5. Riskanalys'!L138=\"x\",\"x\",IF('5. Riskanalys'!M138<>\"\",\"x\",\"\"))","v":""}]
[null,null,null,null,null,{"$f":"'5. Riskanalys'!C139","v":0},null,{"$f":"'5. Riskanalys'!E139","v":0},null,{"$f":"'5. Riskanalys'!G139","v":0},{"$f":"'5. Riskanalys'!H139","v":"Leverans"},{"$f":"'5. Riskanalys'!I139","v":{"$error":"#N/A"}},{"$f":"'5. Riskanalys'!J139","v":{"$error":"#N/A"}},{"$f":"'5. Riskanalys'!K139","v":{"$error":"#N/A"}},{"$f":"IF('5. Riskanalys'!L139=\"x\",\"x\",IF('5. Riskanalys'!M139<>\"\",\"x\",\"\"))","v":""}]
[{"$f":"'5. Riskanalys'!A140:A141","v":0},{"$f":"'5. Riskanalys'!#REF!","v":{"$error":"#REF!"}},{"$f":"'5. Riskanalys'!#REF!","v":{"$error":"#REF!"}},{"$f":"'5. Riskanalys'!#REF!","v":{"$error":"#REF!"}},{"$f":"'5. Riskanalys'!B140:B141","v":0},{"$f":"'5. Riskanalys'!C140","v":0},{"$f":"'5. Riskanalys'!D140:D141","v":0},{"$f":"'5. Riskanalys'!E140","v":0},{"$f":"'5. Riskanalys'!F140:F141","v":0},{"$f":"'5. Riskanalys'!G140","v":0},{"$f":"'5. Riskanalys'!H140","v":"Kvalitet"},{"$f":"'5. Riskanalys'!I140","v":{"$error":"#N/A"}},{"$f":"'5. Riskanalys'!J140","v":{"$error":"#N/A"}},{"$f":"'5. Riskanalys'!K140","v":{"$error":"#N/A"}},{"$f":"IF('5. Riskanalys'!L140=\"x\",\"x\",IF('5. Riskanalys'!M140<>\"\",\"x\",\"\"))","v":""}]
[null,null,null,null,null,{"$f":"'5. Riskanalys'!C141","v":0},null,{"$f":"'5. Riskanalys'!E141","v":0},null,{"$f":"'5. Riskanalys'!G141","v":0},{"$f":"'5. Riskanalys'!H141","v":"Leverans"},{"$f":"'5. Riskanalys'!I141","v":{"$error":"#N/A"}},{"$f":"'5. Riskanalys'!J141","v":{"$error":"#N/A"}},{"$f":"'5. Riskanalys'!K141","v":{"$error":"#N/A"}},{"$f":"IF('5. Riskanalys'!L141=\"x\",\"x\",IF('5. Riskanalys'!M141<>\"\",\"x\",\"\"))","v":""}]
[{"$f":"'5. Riskanalys'!A142:A143","v":0},{"$f":"'5. Riskanalys'!#REF!","v":{"$error":"#REF!"}},{"$f":"'5. Riskanalys'!#REF!","v":{"$error":"#REF!"}},{"$f":"'5. Riskanalys'!#REF!","v":{"$error":"#REF!"}},{"$f":"'5. Riskanalys'!B142:B143","v":0},{"$f":"'5. Riskanalys'!C142","v":0},{"$f":"'5. Riskanalys'!D142:D143","v":0},{"$f":"'5. Riskanalys'!E142","v":0},{"$f":"'5. Riskanalys'!F142:F143","v":0},{"$f":"'5. Riskanalys'!G142","v":0},{"$f":"'5. Riskanalys'!H142","v":"Kvalitet"},{"$f":"'5. Riskanalys'!I142","v":{"$error":"#N/A"}},{"$f":"'5. Riskanalys'!J142","v":{"$error":"#N/A"}},{"$f":"'5. Riskanalys'!K142","v":{"$error":"#N/A"}},{"$f":"IF('5. Riskanalys'!L142=\"x\",\"x\",IF('5. Riskanalys'!M142<>\"\",\"x\",\"\"))","v":""}]
[null,null,null,null,null,{"$f":"'5. Riskanalys'!C143","v":0},null,{"$f":"'5. Riskanalys'!E143","v":0},null,{"$f":"'5. Riskanalys'!G143","v":0},{"$f":"'5. Riskanalys'!H143","v":"Leverans"},{"$f":"'5. Riskanalys'!I143","v":{"$error":"#N/A"}},{"$f":"'5. Riskanalys'!J143","v":{"$error":"#N/A"}},{"$f":"'5. Riskanalys'!K143","v":{"$error":"#N/A"}},{"$f":"IF('5. Riskanalys'!L143=\"x\",\"x\",IF('5. Riskanalys'!M143<>\"\",\"x\",\"\"))","v":""}]
[{"$f":"'5. Riskanalys'!A144:A145","v":0},{"$f":"'5. Riskanalys'!#REF!","v":{"$error":"#REF!"}},{"$f":"'5. Riskanalys'!#REF!","v":{"$error":"#REF!"}},{"$f":"'5. Riskanalys'!#REF!","v":{"$error":"#REF!"}},{"$f":"'5. Riskanalys'!B144:B145","v":0},{"$f":"'5. Riskanalys'!C144","v":0},{"$f":"'5. Riskanalys'!D144:D145","v":0},{"$f":"'5. Riskanalys'!E144","v":0},{"$f":"'5. Riskanalys'!F144:F145","v":0},{"$f":"'5. Riskanalys'!G144","v":0},{"$f":"'5. Riskanalys'!H144","v":"Kvalitet"},{"$f":"'5. Riskanalys'!I144","v":{"$error":"#N/A"}},{"$f":"'5. Riskanalys'!J144","v":{"$error":"#N/A"}},{"$f":"'5. Riskanalys'!K144","v":{"$error":"#N/A"}},{"$f":"IF('5. Riskanalys'!L144=\"x\",\"x\",IF('5. Riskanalys'!M144<>\"\",\"x\",\"\"))","v":""}]
[null,null,null,null,null,{"$f":"'5. Riskanalys'!C145","v":0},null,{"$f":"'5. Riskanalys'!E145","v":0},null,{"$f":"'5. Riskanalys'!G145","v":0},{"$f":"'5. Riskanalys'!H145","v":"Leverans"},{"$f":"'5. Riskanalys'!I145","v":{"$error":"#N/A"}},{"$f":"'5. Riskanalys'!J145","v":{"$error":"#N/A"}},{"$f":"'5. Riskanalys'!K145","v":{"$error":"#N/A"}},{"$f":"IF('5. Riskanalys'!L145=\"x\",\"x\",IF('5. Riskanalys'!M145<>\"\",\"x\",\"\"))","v":""}]
[{"$f":"'5. Riskanalys'!A146:A147","v":0},{"$f":"'5. Riskanalys'!#REF!","v":{"$error":"#REF!"}},{"$f":"'5. Riskanalys'!#REF!","v":{"$error":"#REF!"}},{"$f":"'5. Riskanalys'!#REF!","v":{"$error":"#REF!"}},{"$f":"'5. Riskanalys'!B146:B147","v":0},{"$f":"'5. Riskanalys'!C146","v":0},{"$f":"'5. Riskanalys'!D146:D147","v":0},{"$f":"'5. Riskanalys'!E146","v":0},{"$f":"'5. Riskanalys'!F146:F147","v":0},{"$f":"'5. Riskanalys'!G146","v":0},{"$f":"'5. Riskanalys'!H146","v":"Kvalitet"},{"$f":"'5. Riskanalys'!I146","v":{"$error":"#N/A"}},{"$f":"'5. Riskanalys'!J146","v":{"$error":"#N/A"}},{"$f":"'5. Riskanalys'!K146","v":{"$error":"#N/A"}},{"$f":"IF('5. Riskanalys'!L146=\"x\",\"x\",IF('5. Riskanalys'!M146<>\"\",\"x\",\"\"))","v":""}]
[null,null,null,null,null,{"$f":"'5. Riskanalys'!C147","v":0},null,{"$f":"'5. Riskanalys'!E147","v":0},null,{"$f":"'5. Riskanalys'!G147","v":0},{"$f":"'5. Riskanalys'!H147","v":"Leverans"},{"$f":"'5. Riskanalys'!I147","v":{"$error":"#N/A"}},{"$f":"'5. Riskanalys'!J147","v":{"$error":"#N/A"}},{"$f":"'5. Riskanalys'!K147","v":{"$error":"#N/A"}},{"$f":"IF('5. Riskanalys'!L147=\"x\",\"x\",IF('5. Riskanalys'!M147<>\"\",\"x\",\"\"))","v":""}]
[{"$f":"'5. Riskanalys'!A148:A149","v":0},{"$f":"'5. Riskanalys'!#REF!","v":{"$error":"#REF!"}},{"$f":"'5. Riskanalys'!#REF!","v":{"$error":"#REF!"}},{"$f":"'5. Riskanalys'!#REF!","v":{"$error":"#REF!"}},{"$f":"'5. Riskanalys'!B148:B149","v":0},{"$f":"'5. Riskanalys'!C148","v":0},{"$f":"'5. Riskanalys'!D148:D149","v":0},{"$f":"'5. Riskanalys'!E148","v":0},{"$f":"'5. Riskanalys'!F148:F149","v":0},{"$f":"'5. Riskanalys'!G148","v":0},{"$f":"'5. Riskanalys'!H148","v":"Kvalitet"},{"$f":"'5. Riskanalys'!I148","v":{"$error":"#N/A"}},{"$f":"'5. Riskanalys'!J148","v":{"$error":"#N/A"}},{"$f":"'5. Riskanalys'!K148","v":{"$error":"#N/A"}},{"$f":"IF('5. Riskanalys'!L148=\"x\",\"x\",IF('5. Riskanalys'!M148<>\"\",\"x\",\"\"))","v":""}]
[null,null,null,null,null,{"$f":"'5. Riskanalys'!C149","v":0},null,{"$f":"'5. Riskanalys'!E149","v":0},null,{"$f":"'5. Riskanalys'!G149","v":0},{"$f":"'5. Riskanalys'!H149","v":"Leverans"},{"$f":"'5. Riskanalys'!I149","v":{"$error":"#N/A"}},{"$f":"'5. Riskanalys'!J149","v":{"$error":"#N/A"}},{"$f":"'5. Riskanalys'!K149","v":{"$error":"#N/A"}},{"$f":"IF('5. Riskanalys'!L149=\"x\",\"x\",IF('5. Riskanalys'!M149<>\"\",\"x\",\"\"))","v":""}]
[{"$f":"'5. Riskanalys'!A150:A151","v":0},{"$f":"'5. Riskanalys'!#REF!","v":{"$error":"#REF!"}},{"$f":"'5. Riskanalys'!#REF!","v":{"$error":"#REF!"}},{"$f":"'5. Riskanalys'!#REF!","v":{"$error":"#REF!"}},{"$f":"'5. Riskanalys'!B150:B151","v":0},{"$f":"'5. Riskanalys'!C150","v":0},{"$f":"'5. Riskanalys'!D150:D151","v":0},{"$f":"'5. Riskanalys'!E150","v":0},{"$f":"'5. Riskanalys'!F150:F151","v":0},{"$f":"'5. Riskanalys'!G150","v":0},{"$f":"'5. Riskanalys'!H150","v":"Kvalitet"},{"$f":"'5. Riskanalys'!I150","v":{"$error":"#N/A"}},{"$f":"'5. Riskanalys'!J150","v":{"$error":"#N/A"}},{"$f":"'5. Riskanalys'!K150","v":{"$error":"#N/A"}},{"$f":"IF('5. Riskanalys'!L150=\"x\",\"x\",IF('5. Riskanalys'!M150<>\"\",\"x\",\"\"))","v":""}]
[null,null,null,null,null,{"$f":"'5. Riskanalys'!C151","v":0},null,{"$f":"'5. Riskanalys'!E151","v":0},null,{"$f":"'5. Riskanalys'!G151","v":0},{"$f":"'5. Riskanalys'!H151","v":"Leverans"},{"$f":"'5. Riskanalys'!I151","v":{"$error":"#N/A"}},{"$f":"'5. Riskanalys'!J151","v":{"$error":"#N/A"}},{"$f":"'5. Riskanalys'!K151","v":{"$error":"#N/A"}},{"$f":"IF('5. Riskanalys'!L151=\"x\",\"x\",IF('5. Riskanalys'!M151<>\"\",\"x\",\"\"))","v":""}]
[{"$f":"'5. Riskanalys'!A152:A153","v":0},null,null,null,null,null,null,null,null,null,{"$f":"'5. Riskanalys'!H152","v":"Kvalitet"},{"$f":"'5. Riskanalys'!I152","v":{"$error":"#N/A"}},{"$f":"'5. Riskanalys'!J152","v":{"$error":"#N/A"}},{"$f":"'5. Riskanalys'!K152","v":{"$error":"#N/A"}},{"$f":"IF('5. Riskanalys'!L152=\"x\",\"x\",IF('5. Riskanalys'!M152<>\"\",\"x\",\"\"))","v":""}]
[null,null,null,null,null,null,null,null,null,null,{"$f":"'5. Riskanalys'!H153","v":"Leverans"},{"$f":"'5. Riskanalys'!I153","v":{"$error":"#N/A"}},{"$f":"'5. Riskanalys'!J153","v":{"$error":"#N/A"}},{"$f":"'5. Riskanalys'!K153","v":{"$error":"#N/A"}},{"$f":"IF('5. Riskanalys'!L153=\"x\",\"x\",IF('5. Riskanalys'!M153<>\"\",\"x\",\"\"))","v":""}]
[{"$f":"'5. Riskanalys'!A154:A155","v":0},null,null,null,null,null,null,null,null,null,{"$f":"'5. Riskanalys'!H154","v":"Kvalitet"},{"$f":"'5. Riskanalys'!I154","v":{"$error":"#N/A"}},{"$f":"'5. Riskanalys'!J154","v":{"$error":"#N/A"}},{"$f":"'5. Riskanalys'!K154","v":{"$error":"#N/A"}},{"$f":"IF('5. Riskanalys'!L154=\"x\",\"x\",IF('5. Riskanalys'!M154<>\"\",\"x\",\"\"))","v":""}]
[null,null,null,null,null,null,null,null,null,null,{"$f":"'5. Riskanalys'!H155","v":"Leverans"},{"$f":"'5. Riskanalys'!I155","v":{"$error":"#N/A"}},{"$f":"'5. Riskanalys'!J155","v":{"$error":"#N/A"}},{"$f":"'5. Riskanalys'!K155","v":{"$error":"#N/A"}},{"$f":"IF('5. Riskanalys'!L155=\"x\",\"x\",IF('5. Riskanalys'!M155<>\"\",\"x\",\"\"))","v":""}]
[{"$f":"'5. Riskanalys'!A156:A157","v":"Oönskade händelser Klimatanalys"}]
[{"$f":"'5. Riskanalys'!A157:A158","v":0},null,null,null,null,null,null,null,null,null,{"$f":"'5. Riskanalys'!H157","v":"Kvalitet"},{"$f":"'5. Riskanalys'!I157","v":{"$error":"#N/A"}},{"$f":"'5. Riskanalys'!J157","v":{"$error":"#N/A"}},{"$f":"'5. Riskanalys'!K157","v":{"$error":"#N/A"}},{"$f":"IF('5. Riskanalys'!L157=\"x\",\"x\",IF('5. Riskanalys'!M157<>\"\",\"x\",\"\"))","v":""}]
[null,null,null,null,null,null,null,null,null,null,{"$f":"'5. Riskanalys'!H158","v":"Leverans"},{"$f":"'5. Riskanalys'!I158","v":{"$error":"#N/A"}},{"$f":"'5. Riskanalys'!J158","v":{"$error":"#N/A"}},{"$f":"'5. Riskanalys'!K158","v":{"$error":"#N/A"}},{"$f":"IF('5. Riskanalys'!L158=\"x\",\"x\",IF('5. Riskanalys'!M158<>\"\",\"x\",\"\"))","v":""}]
[{"$f":"'5. Riskanalys'!A159:A160","v":"Ökad risk för låga grundvattennivåer i samband med låga perioder med värmebölja"},null,null,null,null,null,null,null,null,null,{"$f":"'5. Riskanalys'!H159","v":"Kvalitet"},{"$f":"'5. Riskanalys'!I159","v":1},{"$f":"'5. Riskanalys'!J159","v":1},{"$f":"'5. Riskanalys'!K159","v":2},{"$f":"IF('5. Riskanalys'!L159=\"x\",\"x\",IF('5. Riskanalys'!M159<>\"\",\"x\",\"\"))","v":""}]
[null,null,null,null,null,null,null,null,null,null,{"$f":"'5. Riskanalys'!H160","v":"Leverans"},{"$f":"'5. Riskanalys'!I160","v":5},{"$f":"'5. Riskanalys'!J160","v":5},{"$f":"'5. Riskanalys'!K160","v":10},{"$f":"IF('5. Riskanalys'!L160=\"x\",\"x\",IF('5. Riskanalys'!M160<>\"\",\"x\",\"\"))","v":""}]
[{"$f":"'5. Riskanalys'!A161:A162","v":"Bräddning av pumpstationer som leder till påverkan på vattenkvalitet. "},null,null,null,null,null,null,null,null,null,{"$f":"'5. Riskanalys'!H161","v":"Kvalitet"},{"$f":"'5. Riskanalys'!I161","v":10},{"$f":"'5. Riskanalys'!J161","v":10},{"$f":"'5. Riskanalys'!K161","v":20},{"$f":"IF('5. Riskanalys'!L161=\"x\",\"x\",IF('5. Riskanalys'!M161<>\"\",\"x\",\"\"))","v":"x"},"För närliggande pumpstationer skall bräddningar inte få förekomma (alternativt att bräddvattnet samlas upp) och för övriga pumpstationer skall antalet bräddningar minskas. ","1. Dokumentera bräddningsfrekvens i pumpstationerna och inventera vilka pumpstationer som utgör en stor risk för vattentäkten utifrån bräddningsfrekvens och läge. \n2. Bygg om pumpstationerna så att bräddvattnet inte påverkar vattentäkten (ex. sluten tank) och/eller bygg separata ledningar för dagvatten för att minska belastningen på pumpstationerna. "]
[null,null,null,null,null,null,null,null,null,null,{"$f":"'5. Riskanalys'!H162","v":"Leverans"},{"$f":"'5. Riskanalys'!I162","v":1},{"$f":"'5. Riskanalys'!J162","v":1},{"$f":"'5. Riskanalys'!K162","v":2},{"$f":"IF('5. Riskanalys'!L162=\"x\",\"x\",IF('5. Riskanalys'!M162<>\"\",\"x\",\"\"))","v":""}]
[{"$f":"'5. Riskanalys'!A163:A164","v":"Avloppspåverkan från grannkommunens avloppsreningsverk på ytvattnet som påverkar grundvattenkvaliteten "},null,null,null,null,null,null,null,null,null,{"$f":"'5. Riskanalys'!H163","v":"Kvalitet"},{"$f":"'5. Riskanalys'!I163","v":10},{"$f":"'5. Riskanalys'!J163","v":20},{"$f":"'5. Riskanalys'!K163","v":20},{"$f":"IF('5. Riskanalys'!L163=\"x\",\"x\",IF('5. Riskanalys'!M163<>\"\",\"x\",\"\"))","v":"x"},"Att råvattenkvaliteten i ån skall uppfylla Livsmedelsverkets krav (gränsvärden) för mikrobiologiska föroreningar.","Provtagning av vattenkvalitet i ån. Följ upp trender med avseende på mikrobiologiska föroreningar. \nTa upp ärendet med grannkommenen angående ev åtgärder vid utsläppspunkten. "]
[null,null,null,null,null,null,null,null,null,null,{"$f":"'5. Riskanalys'!H164","v":"Leverans"},{"$f":"'5. Riskanalys'!I164","v":1},{"$f":"'5. Riskanalys'!J164","v":2},{"$f":"'5. Riskanalys'!K164","v":2},{"$f":"IF('5. Riskanalys'!L164=\"x\",\"x\",IF('5. Riskanalys'!M164<>\"\",\"x\",\"\"))","v":""}]
[{"$f":"'5. Riskanalys'!A165:A166","v":0},null,null,null,null,null,null,null,null,null,{"$f":"'5. Riskanalys'!H165","v":"Kvalitet"},{"$f":"'5. Riskanalys'!I165","v":{"$error":"#N/A"}},{"$f":"'5. Riskanalys'!J165","v":{"$error":"#N/A"}},{"$f":"'5. Riskanalys'!K165","v":{"$error":"#N/A"}},{"$f":"IF('5. Riskanalys'!L165=\"x\",\"x\",IF('5. Riskanalys'!M165<>\"\",\"x\",\"\"))","v":""}]
[null,null,null,null,null,null,null,null,null,null,{"$f":"'5. Riskanalys'!H166","v":"Leverans"},{"$f":"'5. Riskanalys'!I166","v":{"$error":"#N/A"}},{"$f":"'5. Riskanalys'!J166","v":{"$error":"#N/A"}},{"$f":"'5. Riskanalys'!K166","v":{"$error":"#N/A"}},{"$f":"IF('5. Riskanalys'!L166=\"x\",\"x\",IF('5. Riskanalys'!M166<>\"\",\"x\",\"\"))","v":""}]
[{"$f":"'5. Riskanalys'!A167:A168","v":0},null,null,null,null,null,null,null,null,null,{"$f":"'5. Riskanalys'!H167","v":"Kvalitet"},{"$f":"'5. Riskanalys'!I167","v":{"$error":"#N/A"}},{"$f":"'5. Riskanalys'!J167","v":{"$error":"#N/A"}},{"$f":"'5. Riskanalys'!K167","v":{"$error":"#N/A"}},{"$f":"IF('5. Riskanalys'!L167=\"x\",\"x\",IF('5. Riskanalys'!M167<>\"\",\"x\",\"\"))","v":""}]
[null,null,null,null,null,null,null,null,null,null,{"$f":"'5. Riskanalys'!H168","v":"Leverans"},{"$f":"'5. Riskanalys'!I168","v":{"$error":"#N/A"}},{"$f":"'5. Riskanalys'!J168","v":{"$error":"#N/A"}},{"$f":"'5. Riskanalys'!K168","v":{"$error":"#N/A"}},{"$f":"IF('5. Riskanalys'!L168=\"x\",\"x\",IF('5. Riskanalys'!M168<>\"\",\"x\",\"\"))","v":""}]
[{"$f":"'5. Riskanalys'!A169:A170","v":"Ras och skred som leder till ledningsbrott"},null,null,null,null,null,null,null,null,null,{"$f":"'5. Riskanalys'!H169","v":"Kvalitet"},{"$f":"'5. Riskanalys'!I169","v":1},{"$f":"'5. Riskanalys'!J169","v":2},{"$f":"'5. Riskanalys'!K169","v":2},{"$f":"IF('5. Riskanalys'!L169=\"x\",\"x\",IF('5. Riskanalys'!M169<>\"\",\"x\",\"\"))","v":""}]
[null,null,null,null,null,null,null,null,null,null,{"$f":"'5. Riskanalys'!H170","v":"Leverans"},{"$f":"'5. Riskanalys'!I170","v":16},{"$f":"'5. Riskanalys'!J170","v":32},{"$f":"'5. Riskanalys'!K170","v":32},{"$f":"IF('5. Riskanalys'!L170=\"x\",\"x\",IF('5. Riskanalys'!M170<>\"\",\"x\",\"\"))","v":"x"},"Redundanta ledningar i områden med risk för ras och skred.","Inventera ledningar i områden som är ras/skredbenägna och åtgärda. "]
[{"$f":"'5. Riskanalys'!A171:A172","v":"Försämrad råvattenkvalitet orsakad av förändrad vattenkvalitet i ån med avseende på organiskt material. "},null,null,null,null,null,null,null,null,null,{"$f":"'5. Riskanalys'!H171","v":"Kvalitet"},{"$f":"'5. Riskanalys'!I171","v":5},{"$f":"'5. Riskanalys'!J171","v":10},{"$f":"'5. Riskanalys'!K171","v":10},{"$f":"IF('5. Riskanalys'!L171=\"x\",\"x\",IF('5. Riskanalys'!M171<>\"\",\"x\",\"\"))","v":""}]
[null,null,null,null,null,null,null,null,null,null,{"$f":"'5. Riskanalys'!H172","v":"Leverans"},{"$f":"'5. Riskanalys'!I172","v":1},{"$f":"'5. Riskanalys'!J172","v":2},{"$f":"'5. Riskanalys'!K172","v":2},{"$f":"IF('5. Riskanalys'!L172=\"x\",\"x\",IF('5. Riskanalys'!M172<>\"\",\"x\",\"\"))","v":""}]
[{"$f":"'5. Riskanalys'!A173:A174","v":0},null,null,null,null,null,null,null,null,null,{"$f":"'5. Riskanalys'!H173","v":"Kvalitet"},{"$f":"'5. Riskanalys'!I173","v":{"$error":"#N/A"}},{"$f":"'5. Riskanalys'!J173","v":{"$error":"#N/A"}},{"$f":"'5. Riskanalys'!K173","v":{"$error":"#N/A"}},{"$f":"IF('5. Riskanalys'!L173=\"x\",\"x\",IF('5. Riskanalys'!M173<>\"\",\"x\",\"\"))","v":""}]
[null,null,null,null,null,null,null,null,null,null,{"$f":"'5. Riskanalys'!H174","v":"Leverans"},{"$f":"'5. Riskanalys'!I174","v":{"$error":"#N/A"}},{"$f":"'5. Riskanalys'!J174","v":{"$error":"#N/A"}},{"$f":"'5. Riskanalys'!K174","v":{"$error":"#N/A"}},{"$f":"IF('5. Riskanalys'!L174=\"x\",\"x\",IF('5. Riskanalys'!M174<>\"\",\"x\",\"\"))","v":""}]
[{"$f":"'5. Riskanalys'!A175:A176","v":0},null,null,null,null,null,null,null,null,null,{"$f":"'5. Riskanalys'!H175","v":"Kvalitet"},{"$f":"'5. Riskanalys'!I175","v":{"$error":"#N/A"}},{"$f":"'5. Riskanalys'!J175","v":{"$error":"#N/A"}},{"$f":"'5. Riskanalys'!K175","v":{"$error":"#N/A"}},{"$f":"IF('5. Riskanalys'!L175=\"x\",\"x\",IF('5. Riskanalys'!M175<>\"\",\"x\",\"\"))","v":""}]
[null,null,null,null,null,null,null,null,null,null,{"$f":"'5. Riskanalys'!H176","v":"Leverans"},{"$f":"'5. Riskanalys'!I176","v":{"$error":"#N/A"}},{"$f":"'5. Riskanalys'!J176","v":{"$error":"#N/A"}},{"$f":"'5. Riskanalys'!K176","v":{"$error":"#N/A"}},{"$f":"IF('5. Riskanalys'!L176=\"x\",\"x\",IF('5. Riskanalys'!M176<>\"\",\"x\",\"\"))","v":""}]
[{"$f":"'5. Riskanalys'!A177:A178","v":0},null,null,null,null,null,null,null,null,null,{"$f":"'5. Riskanalys'!H177","v":"Kvalitet"},{"$f":"'5. Riskanalys'!I177","v":{"$error":"#N/A"}},{"$f":"'5. Riskanalys'!J177","v":{"$error":"#N/A"}},{"$f":"'5. Riskanalys'!K177","v":{"$error":"#N/A"}},{"$f":"IF('5. Riskanalys'!L177=\"x\",\"x\",IF('5. Riskanalys'!M177<>\"\",\"x\",\"\"))","v":""}]
[null,null,null,null,null,null,null,null,null,null,{"$f":"'5. Riskanalys'!H178","v":"Leverans"},{"$f":"'5. Riskanalys'!I178","v":{"$error":"#N/A"}},{"$f":"'5. Riskanalys'!J178","v":{"$error":"#N/A"}},{"$f":"'5. Riskanalys'!K178","v":{"$error":"#N/A"}},{"$f":"IF('5. Riskanalys'!L178=\"x\",\"x\",IF('5. Riskanalys'!M178<>\"\",\"x\",\"\"))","v":""}]
[{"$f":"'5. Riskanalys'!A179:A180","v":0},null,null,null,null,null,null,null,null,null,{"$f":"'5. Riskanalys'!H179","v":"Kvalitet"},{"$f":"'5. Riskanalys'!I179","v":{"$error":"#N/A"}},{"$f":"'5. Riskanalys'!J179","v":{"$error":"#N/A"}},{"$f":"'5. Riskanalys'!K179","v":{"$error":"#N/A"}},{"$f":"IF('5. Riskanalys'!L179=\"x\",\"x\",IF('5. Riskanalys'!M179<>\"\",\"x\",\"\"))","v":""}]
[null,null,null,null,null,null,null,null,null,null,{"$f":"'5. Riskanalys'!H180","v":"Leverans"},{"$f":"'5. Riskanalys'!I180","v":{"$error":"#N/A"}},{"$f":"'5. Riskanalys'!J180","v":{"$error":"#N/A"}},{"$f":"'5. Riskanalys'!K180","v":{"$error":"#N/A"}},{"$f":"IF('5. Riskanalys'!L180=\"x\",\"x\",IF('5. Riskanalys'!M180<>\"\",\"x\",\"\"))","v":""}]
[{"$f":"'5. Riskanalys'!A181:A182","v":0},null,null,null,null,null,null,null,null,null,{"$f":"'5. Riskanalys'!H181","v":"Kvalitet"},{"$f":"'5. Riskanalys'!I181","v":{"$error":"#N/A"}},{"$f":"'5. Riskanalys'!J181","v":{"$error":"#N/A"}},{"$f":"'5. Riskanalys'!K181","v":{"$error":"#N/A"}},{"$f":"IF('5. Riskanalys'!L181=\"x\",\"x\",IF('5. Riskanalys'!M181<>\"\",\"x\",\"\"))","v":""}]
[null,null,null,null,null,null,null,null,null,null,{"$f":"'5. Riskanalys'!H182","v":"Leverans"},{"$f":"'5. Riskanalys'!I182","v":{"$error":"#N/A"}},{"$f":"'5. Riskanalys'!J182","v":{"$error":"#N/A"}},{"$f":"'5. Riskanalys'!K182","v":{"$error":"#N/A"}},{"$f":"IF('5. Riskanalys'!L182=\"x\",\"x\",IF('5. Riskanalys'!M182<>\"\",\"x\",\"\"))","v":""}]
[{"$f":"'5. Riskanalys'!A183:A184","v":0},null,null,null,null,null,null,null,null,null,{"$f":"'5. Riskanalys'!H183","v":"Kvalitet"},{"$f":"'5. Riskanalys'!I183","v":{"$error":"#N/A"}},{"$f":"'5. Riskanalys'!J183","v":{"$error":"#N/A"}},{"$f":"'5. Riskanalys'!K183","v":{"$error":"#N/A"}},{"$f":"IF('5. Riskanalys'!L183=\"x\",\"x\",IF('5. Riskanalys'!M183<>\"\",\"x\",\"\"))","v":""}]
[null,null,null,null,null,null,null,null,null,null,{"$f":"'5. Riskanalys'!H184","v":"Leverans"},{"$f":"'5. Riskanalys'!I184","v":{"$error":"#N/A"}},{"$f":"'5. Riskanalys'!J184","v":{"$error":"#N/A"}},{"$f":"'5. Riskanalys'!K184","v":{"$error":"#N/A"}},{"$f":"IF('5. Riskanalys'!L184=\"x\",\"x\",IF('5. Riskanalys'!M184<>\"\",\"x\",\"\"))","v":""}]
[{"$f":"'5. Riskanalys'!A185:A186","v":0},null,null,null,null,null,null,null,null,null,{"$f":"'5. Riskanalys'!H185","v":"Kvalitet"},{"$f":"'5. Riskanalys'!I185","v":{"$error":"#N/A"}},{"$f":"'5. Riskanalys'!J185","v":{"$error":"#N/A"}},{"$f":"'5. Riskanalys'!K185","v":{"$error":"#N/A"}},{"$f":"IF('5. Riskanalys'!L185=\"x\",\"x\",IF('5. Riskanalys'!M185<>\"\",\"x\",\"\"))","v":""}]
[null,null,null,null,null,null,null,null,null,null,{"$f":"'5. Riskanalys'!H186","v":"Leverans"},{"$f":"'5. Riskanalys'!I186","v":{"$error":"#N/A"}},{"$f":"'5. Riskanalys'!J186","v":{"$error":"#N/A"}},{"$f":"'5. Riskanalys'!K186","v":{"$error":"#N/A"}},{"$f":"IF('5. Riskanalys'!L186=\"x\",\"x\",IF('5. Riskanalys'!M186<>\"\",\"x\",\"\"))","v":""}]
[{"$f":"'5. Riskanalys'!A187:A188","v":0},null,null,null,null,null,null,null,null,null,{"$f":"'5. Riskanalys'!H187","v":"Kvalitet"},{"$f":"'5. Riskanalys'!I187","v":{"$error":"#N/A"}},{"$f":"'5. Riskanalys'!J187","v":{"$error":"#N/A"}},{"$f":"'5. Riskanalys'!K187","v":{"$error":"#N/A"}},{"$f":"IF('5. Riskanalys'!L187=\"x\",\"x\",IF('5. Riskanalys'!M187<>\"\",\"x\",\"\"))","v":""}]
[null,null,null,null,null,null,null,null,null,null,{"$f":"'5. Riskanalys'!H188","v":"Leverans"},{"$f":"'5. Riskanalys'!I188","v":{"$error":"#N/A"}},{"$f":"'5. Riskanalys'!J188","v":{"$error":"#N/A"}},{"$f":"'5. Riskanalys'!K188","v":{"$error":"#N/A"}},{"$f":"IF('5. Riskanalys'!L188=\"x\",\"x\",IF('5. Riskanalys'!M188<>\"\",\"x\",\"\"))","v":""}]
[{"$f":"'5. Riskanalys'!A189:A190","v":"Tillväxt av mikroorganismer i ledningar som leder till otjänligt vatten "},null,null,null,null,null,null,null,null,null,{"$f":"'5. Riskanalys'!H189","v":"Kvalitet"},{"$f":"'5. Riskanalys'!I189","v":10},{"$f":"'5. Riskanalys'!J189","v":20},{"$f":"'5. Riskanalys'!K189","v":30},{"$f":"IF('5. Riskanalys'!L189=\"x\",\"x\",IF('5. Riskanalys'!M189<>\"\",\"x\",\"\"))","v":"x"},"Att råvattenkvaliteten skall klara Livsmedelsverkets krav (gränsvärden) för mikrobiologiska föroreningar","Rutiner för spolning av ledningar. Upprätta en modell över ledningsnätet för att kartlägga området med dålig omsättning."]
[null,null,null,null,null,null,null,null,null,null,{"$f":"'5. Riskanalys'!H190","v":"Leverans"},{"$f":"'5. Riskanalys'!I190","v":1},{"$f":"'5. Riskanalys'!J190","v":2},{"$f":"'5. Riskanalys'!K190","v":3},{"$f":"IF('5. Riskanalys'!L190=\"x\",\"x\",IF('5. Riskanalys'!M190<>\"\",\"x\",\"\"))","v":""}]
[{"$f":"'5. Riskanalys'!A191:A192","v":0},null,null,null,null,null,null,null,null,null,{"$f":"'5. Riskanalys'!H191","v":"Kvalitet"},{"$f":"'5. Riskanalys'!I191","v":{"$error":"#N/A"}},{"$f":"'5. Riskanalys'!J191","v":{"$error":"#N/A"}},{"$f":"'5. Riskanalys'!K191","v":{"$error":"#N/A"}},{"$f":"IF('5. Riskanalys'!L191=\"x\",\"x\",IF('5. Riskanalys'!M191<>\"\",\"x\",\"\"))","v":""}]
[null,null,null,null,null,null,null,null,null,null,{"$f":"'5. Riskanalys'!H192","v":"Leverans"},{"$f":"'5. Riskanalys'!I192","v":{"$error":"#N/A"}},{"$f":"'5. Riskanalys'!J192","v":{"$error":"#N/A"}},{"$f":"'5. Riskanalys'!K192","v":{"$error":"#N/A"}},{"$f":"IF('5. Riskanalys'!L192=\"x\",\"x\",IF('5. Riskanalys'!M192<>\"\",\"x\",\"\"))","v":""}]
[{"$f":"'5. Riskanalys'!A193:A194","v":0},null,null,null,null,null,null,null,null,null,{"$f":"'5. Riskanalys'!H193","v":"Kvalitet"},{"$f":"'5. Riskanalys'!I193","v":{"$error":"#N/A"}},{"$f":"'5. Riskanalys'!J193","v":{"$error":"#N/A"}},{"$f":"'5. Riskanalys'!K193","v":{"$error":"#N/A"}},{"$f":"IF('5. Riskanalys'!L193=\"x\",\"x\",IF('5. Riskanalys'!M193<>\"\",\"x\",\"\"))","v":""}]
[null,null,null,null,null,null,null,null,null,null,{"$f":"'5. Riskanalys'!H194","v":"Leverans"},{"$f":"'5. Riskanalys'!I194","v":{"$error":"#N/A"}},{"$f":"'5. Riskanalys'!J194","v":{"$error":"#N/A"}},{"$f":"'5. Riskanalys'!K194","v":{"$error":"#N/A"}},{"$f":"IF('5. Riskanalys'!L194=\"x\",\"x\",IF('5. Riskanalys'!M194<>\"\",\"x\",\"\"))","v":""}]
[{"$f":"'5. Riskanalys'!A195:A196","v":0},null,null,null,null,null,null,null,null,null,{"$f":"'5. Riskanalys'!H195","v":"Kvalitet"},{"$f":"'5. Riskanalys'!I195","v":{"$error":"#N/A"}},{"$f":"'5. Riskanalys'!J195","v":{"$error":"#N/A"}},{"$f":"'5. Riskanalys'!K195","v":{"$error":"#N/A"}},{"$f":"IF('5. Riskanalys'!L195=\"x\",\"x\",IF('5. Riskanalys'!M195<>\"\",\"x\",\"\"))","v":""}]
[null,null,null,null,null,null,null,null,null,null,{"$f":"'5. Riskanalys'!H196","v":"Leverans"},{"$f":"'5. Riskanalys'!I196","v":{"$error":"#N/A"}},{"$f":"'5. Riskanalys'!J196","v":{"$error":"#N/A"}},{"$f":"'5. Riskanalys'!K196","v":{"$error":"#N/A"}},{"$f":"IF('5. Riskanalys'!L196=\"x\",\"x\",IF('5. Riskanalys'!M196<>\"\",\"x\",\"\"))","v":""}]
[{"$f":"'5. Riskanalys'!A197:A198","v":0},null,null,null,null,null,null,null,null,null,{"$f":"'5. Riskanalys'!H197","v":"Kvalitet"},{"$f":"'5. Riskanalys'!I197","v":{"$error":"#N/A"}},{"$f":"'5. Riskanalys'!J197","v":{"$error":"#N/A"}},{"$f":"'5. Riskanalys'!K197","v":{"$error":"#N/A"}},{"$f":"IF('5. Riskanalys'!L197=\"x\",\"x\",IF('5. Riskanalys'!M197<>\"\",\"x\",\"\"))","v":""}]
[null,null,null,null,null,null,null,null,null,null,{"$f":"'5. Riskanalys'!H198","v":"Leverans"},{"$f":"'5. Riskanalys'!I198","v":{"$error":"#N/A"}},{"$f":"'5. Riskanalys'!J198","v":{"$error":"#N/A"}},{"$f":"'5. Riskanalys'!K198","v":{"$error":"#N/A"}},{"$f":"IF('5. Riskanalys'!L198=\"x\",\"x\",IF('5. Riskanalys'!M198<>\"\",\"x\",\"\"))","v":""}]
[{"$f":"'5. Riskanalys'!A199:A200","v":0},null,null,null,null,null,null,null,null,null,{"$f":"'5. Riskanalys'!H199","v":"Kvalitet"},{"$f":"'5. Riskanalys'!I199","v":{"$error":"#N/A"}},{"$f":"'5. Riskanalys'!J199","v":{"$error":"#N/A"}},{"$f":"'5. Riskanalys'!K199","v":{"$error":"#N/A"}},{"$f":"IF('5. Riskanalys'!L199=\"x\",\"x\",IF('5. Riskanalys'!M199<>\"\",\"x\",\"\"))","v":""}]
[null,null,null,null,null,null,null,null,null,null,{"$f":"'5. Riskanalys'!H200","v":"Leverans"},{"$f":"'5. Riskanalys'!I200","v":{"$error":"#N/A"}},{"$f":"'5. Riskanalys'!J200","v":{"$error":"#N/A"}},{"$f":"'5. Riskanalys'!K200","v":{"$error":"#N/A"}},{"$f":"IF('5. Riskanalys'!L200=\"x\",\"x\",IF('5. Riskanalys'!M200<>\"\",\"x\",\"\"))","v":""}]
[{"$f":"'5. Riskanalys'!A201:A202","v":0},null,null,null,null,null,null,null,null,null,{"$f":"'5. Riskanalys'!H201","v":"Kvalitet"},{"$f":"'5. Riskanalys'!I201","v":{"$error":"#N/A"}},{"$f":"'5. Riskanalys'!J201","v":{"$error":"#N/A"}},{"$f":"'5. Riskanalys'!K201","v":{"$error":"#N/A"}},{"$f":"IF('5. Riskanalys'!L201=\"x\",\"x\",IF('5. Riskanalys'!M201<>\"\",\"x\",\"\"))","v":""}]
[null,null,null,null,null,null,null,null,null,null,{"$f":"'5. Riskanalys'!H202","v":"Leverans"},{"$f":"'5. Riskanalys'!I202","v":{"$error":"#N/A"}},{"$f":"'5. Riskanalys'!J202","v":{"$error":"#N/A"}},{"$f":"'5. Riskanalys'!K202","v":{"$error":"#N/A"}},{"$f":"IF('5. Riskanalys'!L202=\"x\",\"x\",IF('5. Riskanalys'!M202<>\"\",\"x\",\"\"))","v":""}]
[{"$f":"'5. Riskanalys'!A203:A204","v":0},null,null,null,null,null,null,null,null,null,{"$f":"'5. Riskanalys'!H203","v":"Kvalitet"},{"$f":"'5. Riskanalys'!I203","v":{"$error":"#N/A"}},{"$f":"'5. Riskanalys'!J203","v":{"$error":"#N/A"}},{"$f":"'5. Riskanalys'!K203","v":{"$error":"#N/A"}},{"$f":"IF('5. Riskanalys'!L203=\"x\",\"x\",IF('5. Riskanalys'!M203<>\"\",\"x\",\"\"))","v":""}]
[null,null,null,null,null,null,null,null,null,null,{"$f":"'5. Riskanalys'!H204","v":"Leverans"},{"$f":"'5. Riskanalys'!I204","v":{"$error":"#N/A"}},{"$f":"'5. Riskanalys'!J204","v":{"$error":"#N/A"}},{"$f":"'5. Riskanalys'!K204","v":{"$error":"#N/A"}},{"$f":"IF('5. Riskanalys'!L204=\"x\",\"x\",IF('5. Riskanalys'!M204<>\"\",\"x\",\"\"))","v":""}]
[{"$f":"'5. Riskanalys'!A205:A206","v":0},null,null,null,null,null,null,null,null,null,{"$f":"'5. Riskanalys'!H205","v":"Kvalitet"},{"$f":"'5. Riskanalys'!I205","v":{"$error":"#N/A"}},{"$f":"'5. Riskanalys'!J205","v":{"$error":"#N/A"}},{"$f":"'5. Riskanalys'!K205","v":{"$error":"#N/A"}},{"$f":"IF('5. Riskanalys'!L205=\"x\",\"x\",IF('5. Riskanalys'!M205<>\"\",\"x\",\"\"))","v":""}]
[null,null,null,null,null,null,null,null,null,null,{"$f":"'5. Riskanalys'!H206","v":"Leverans"},{"$f":"'5. Riskanalys'!I206","v":{"$error":"#N/A"}},{"$f":"'5. Riskanalys'!J206","v":{"$error":"#N/A"}},{"$f":"'5. Riskanalys'!K206","v":{"$error":"#N/A"}},{"$f":"IF('5. Riskanalys'!L206=\"x\",\"x\",IF('5. Riskanalys'!M206<>\"\",\"x\",\"\"))","v":""}]
[{"$f":"'5. Riskanalys'!A207:A208","v":"Översvämning av anläggningsdelar som leder till inläckage av ytvatten och därmed försämrad råvattenkvalitet. "},null,null,null,null,null,null,null,null,null,{"$f":"'5. Riskanalys'!H207","v":"Kvalitet"},{"$f":"'5. Riskanalys'!I207","v":10},{"$f":"'5. Riskanalys'!J207","v":10},{"$f":"'5. Riskanalys'!K207","v":20},{"$f":"IF('5. Riskanalys'!L207=\"x\",\"x\",IF('5. Riskanalys'!M207<>\"\",\"x\",\"\"))","v":"x"},"Att samtliga anläggningar som ligger i områden som riskerar att översvämmas (utifrån genomförd översvämningskartering) skall ha fullgott skydd mot översvämningar.","1. Genomför översvämningskartering\n2. Genomför åtgärder vid de anläggningar som riskerar att översvämmas. "]
[null,null,null,null,null,null,null,null,null,null,{"$f":"'5. Riskanalys'!H208","v":"Leverans"},{"$f":"'5. Riskanalys'!I208","v":1},{"$f":"'5. Riskanalys'!J208","v":1},{"$f":"'5. Riskanalys'!K208","v":2},{"$f":"IF('5. Riskanalys'!L208=\"x\",\"x\",IF('5. Riskanalys'!M208<>\"\",\"x\",\"\"))","v":""}]
[{"$f":"'5. Riskanalys'!A209:A210","v":0},null,null,null,null,null,null,null,null,null,{"$f":"'5. Riskanalys'!H209","v":"Kvalitet"},{"$f":"'5. Riskanalys'!I209","v":{"$error":"#N/A"}},{"$f":"'5. Riskanalys'!J209","v":{"$error":"#N/A"}},{"$f":"'5. Riskanalys'!K209","v":{"$error":"#N/A"}},{"$f":"IF('5. Riskanalys'!L209=\"x\",\"x\",IF('5. Riskanalys'!M209<>\"\",\"x\",\"\"))","v":""}]
[null,null,null,null,null,null,null,null,null,null,{"$f":"'5. Riskanalys'!H210","v":"Leverans"},{"$f":"'5. Riskanalys'!I210","v":{"$error":"#N/A"}},{"$f":"'5. Riskanalys'!J210","v":{"$error":"#N/A"}},{"$f":"'5. Riskanalys'!K210","v":{"$error":"#N/A"}},{"$f":"IF('5. Riskanalys'!L210=\"x\",\"x\",IF('5. Riskanalys'!M210<>\"\",\"x\",\"\"))","v":""}]
[{"$f":"'5. Riskanalys'!A211:A212","v":0},null,null,null,null,null,null,null,null,null,{"$f":"'5. Riskanalys'!H211","v":"Kvalitet"},{"$f":"'5. Riskanalys'!I211","v":{"$error":"#N/A"}},{"$f":"'5. Riskanalys'!J211","v":{"$error":"#N/A"}},{"$f":"'5. Riskanalys'!K211","v":{"$error":"#N/A"}},{"$f":"IF('5. Riskanalys'!L211=\"x\",\"x\",IF('5. Riskanalys'!M211<>\"\",\"x\",\"\"))","v":""}]
[null,null,null,null,null,null,null,null,null,null,{"$f":"'5. Riskanalys'!H212","v":"Leverans"},{"$f":"'5. Riskanalys'!I212","v":{"$error":"#N/A"}},{"$f":"'5. Riskanalys'!J212","v":{"$error":"#N/A"}},{"$f":"'5. Riskanalys'!K212","v":{"$error":"#N/A"}},{"$f":"IF('5. Riskanalys'!L212=\"x\",\"x\",IF('5. Riskanalys'!M212<>\"\",\"x\",\"\"))","v":""}]
[{"$f":"'5. Riskanalys'!A213:A214","v":0},null,null,null,null,null,null,null,null,null,{"$f":"'5. Riskanalys'!H213","v":"Kvalitet"},{"$f":"'5. Riskanalys'!I213","v":{"$error":"#N/A"}},{"$f":"'5. Riskanalys'!J213","v":{"$error":"#N/A"}},{"$f":"'5. Riskanalys'!K213","v":{"$error":"#N/A"}},{"$f":"IF('5. Riskanalys'!L213=\"x\",\"x\",IF('5. Riskanalys'!M213<>\"\",\"x\",\"\"))","v":""}]
[null,null,null,null,null,null,null,null,null,null,{"$f":"'5. Riskanalys'!H214","v":"Leverans"},{"$f":"'5. Riskanalys'!I214","v":{"$error":"#N/A"}},{"$f":"'5. Riskanalys'!J214","v":{"$error":"#N/A"}},{"$f":"'5. Riskanalys'!K214","v":{"$error":"#N/A"}},{"$f":"IF('5. Riskanalys'!L214=\"x\",\"x\",IF('5. Riskanalys'!M214<>\"\",\"x\",\"\"))","v":""}]
[{"$f":"'5. Riskanalys'!A215:A216","v":0},null,null,null,null,null,null,null,null,null,{"$f":"'5. Riskanalys'!H215","v":"Kvalitet"},{"$f":"'5. Riskanalys'!I215","v":{"$error":"#N/A"}},{"$f":"'5. Riskanalys'!J215","v":{"$error":"#N/A"}},{"$f":"'5. Riskanalys'!K215","v":{"$error":"#N/A"}},{"$f":"IF('5. Riskanalys'!L215=\"x\",\"x\",IF('5. Riskanalys'!M215<>\"\",\"x\",\"\"))","v":""}]
[null,null,null,null,null,null,null,null,null,null,{"$f":"'5. Riskanalys'!H216","v":"Leverans"},{"$f":"'5. Riskanalys'!I216","v":{"$error":"#N/A"}},{"$f":"'5. Riskanalys'!J216","v":{"$error":"#N/A"}},{"$f":"'5. Riskanalys'!K216","v":{"$error":"#N/A"}},{"$f":"IF('5. Riskanalys'!L216=\"x\",\"x\",IF('5. Riskanalys'!M216<>\"\",\"x\",\"\"))","v":""}]
[{"$f":"'5. Riskanalys'!A217:A218","v":0},null,null,null,null,null,null,null,null,null,{"$f":"'5. Riskanalys'!H217","v":"Kvalitet"},{"$f":"'5. Riskanalys'!I217","v":{"$error":"#N/A"}},{"$f":"'5. Riskanalys'!J217","v":{"$error":"#N/A"}},{"$f":"'5. Riskanalys'!K217","v":{"$error":"#N/A"}},{"$f":"IF('5. Riskanalys'!L217=\"x\",\"x\",IF('5. Riskanalys'!M217<>\"\",\"x\",\"\"))","v":""}]
[null,null,null,null,null,null,null,null,null,null,{"$f":"'5. Riskanalys'!H218","v":"Leverans"},{"$f":"'5. Riskanalys'!I218","v":{"$error":"#N/A"}},{"$f":"'5. Riskanalys'!J218","v":{"$error":"#N/A"}},{"$f":"'5. Riskanalys'!K218","v":{"$error":"#N/A"}},{"$f":"IF('5. Riskanalys'!L218=\"x\",\"x\",IF('5. Riskanalys'!M218<>\"\",\"x\",\"\"))","v":""}]
[{"$f":"'5. Riskanalys'!A219:A220","v":0},null,null,null,null,null,null,null,null,null,{"$f":"'5. Riskanalys'!H219","v":"Kvalitet"},{"$f":"'5. Riskanalys'!I219","v":{"$error":"#N/A"}},{"$f":"'5. Riskanalys'!J219","v":{"$error":"#N/A"}},{"$f":"'5. Riskanalys'!K219","v":{"$error":"#N/A"}},{"$f":"IF('5. Riskanalys'!L219=\"x\",\"x\",IF('5. Riskanalys'!M219<>\"\",\"x\",\"\"))","v":""}]
[null,null,null,null,null,null,null,null,null,null,{"$f":"'5. Riskanalys'!H220","v":"Leverans"},{"$f":"'5. Riskanalys'!I220","v":{"$error":"#N/A"}},{"$f":"'5. Riskanalys'!J220","v":{"$error":"#N/A"}},{"$f":"'5. Riskanalys'!K220","v":{"$error":"#N/A"}},{"$f":"IF('5. Riskanalys'!L220=\"x\",\"x\",IF('5. Riskanalys'!M220<>\"\",\"x\",\"\"))","v":""}]
[{"$f":"'5. Riskanalys'!A221:A222","v":0},null,null,null,null,null,null,null,null,null,{"$f":"'5. Riskanalys'!H221","v":"Kvalitet"},{"$f":"'5. Riskanalys'!I221","v":{"$error":"#N/A"}},{"$f":"'5. Riskanalys'!J221","v":{"$error":"#N/A"}},{"$f":"'5. Riskanalys'!K221","v":{"$error":"#N/A"}},{"$f":"IF('5. Riskanalys'!L221=\"x\",\"x\",IF('5. Riskanalys'!M221<>\"\",\"x\",\"\"))","v":""}]
[null,null,null,null,null,null,null,null,null,null,{"$f":"'5. Riskanalys'!H222","v":"Leverans"},{"$f":"'5. Riskanalys'!I222","v":{"$error":"#N/A"}},{"$f":"'5. Riskanalys'!J222","v":{"$error":"#N/A"}},{"$f":"'5. Riskanalys'!K222","v":{"$error":"#N/A"}},{"$f":"IF('5. Riskanalys'!L222=\"x\",\"x\",IF('5. Riskanalys'!M222<>\"\",\"x\",\"\"))","v":""}]
[{"$f":"'5. Riskanalys'!A223:A224","v":0},null,null,null,null,null,null,null,null,null,{"$f":"'5. Riskanalys'!H223","v":"Kvalitet"},{"$f":"'5. Riskanalys'!I223","v":{"$error":"#N/A"}},{"$f":"'5. Riskanalys'!J223","v":{"$error":"#N/A"}},{"$f":"'5. Riskanalys'!K223","v":{"$error":"#N/A"}},{"$f":"IF('5. Riskanalys'!L223=\"x\",\"x\",IF('5. Riskanalys'!M223<>\"\",\"x\",\"\"))","v":""}]
[null,null,null,null,null,null,null,null,null,null,{"$f":"'5. Riskanalys'!H224","v":"Leverans"},{"$f":"'5. Riskanalys'!I224","v":{"$error":"#N/A"}},{"$f":"'5. Riskanalys'!J224","v":{"$error":"#N/A"}},{"$f":"'5. Riskanalys'!K224","v":{"$error":"#N/A"}},{"$f":"IF('5. Riskanalys'!L224=\"x\",\"x\",IF('5. Riskanalys'!M224<>\"\",\"x\",\"\"))","v":""}]
[{"$f":"'5. Riskanalys'!A225:A226","v":0},null,null,null,null,null,null,null,null,null,{"$f":"'5. Riskanalys'!H225","v":"Kvalitet"},{"$f":"'5. Riskanalys'!I225","v":{"$error":"#N/A"}},{"$f":"'5. Riskanalys'!J225","v":{"$error":"#N/A"}},{"$f":"'5. Riskanalys'!K225","v":{"$error":"#N/A"}},{"$f":"IF('5. Riskanalys'!L225=\"x\",\"x\",IF('5. Riskanalys'!M225<>\"\",\"x\",\"\"))","v":""}]
[null,null,null,null,null,null,null,null,null,null,{"$f":"'5. Riskanalys'!H226","v":"Leverans"},{"$f":"'5. Riskanalys'!I226","v":{"$error":"#N/A"}},{"$f":"'5. Riskanalys'!J226","v":{"$error":"#N/A"}},{"$f":"'5. Riskanalys'!K226","v":{"$error":"#N/A"}},{"$f":"IF('5. Riskanalys'!L226=\"x\",\"x\",IF('5. Riskanalys'!M226<>\"\",\"x\",\"\"))","v":""}]
[{"$f":"'5. Riskanalys'!A227:A228","v":0},null,null,null,null,null,null,null,null,null,{"$f":"'5. Riskanalys'!H227","v":"Kvalitet"},{"$f":"'5. Riskanalys'!I227","v":{"$error":"#N/A"}},{"$f":"'5. Riskanalys'!J227","v":{"$error":"#N/A"}},{"$f":"'5. Riskanalys'!K227","v":{"$error":"#N/A"}},{"$f":"IF('5. Riskanalys'!L227=\"x\",\"x\",IF('5. Riskanalys'!M227<>\"\",\"x\",\"\"))","v":""}]
[null,null,null,null,null,null,null,null,null,null,{"$f":"'5. Riskanalys'!H228","v":"Leverans"},{"$f":"'5. Riskanalys'!I228","v":{"$error":"#N/A"}},{"$f":"'5. Riskanalys'!J228","v":{"$error":"#N/A"}},{"$f":"'5. Riskanalys'!K228","v":{"$error":"#N/A"}},{"$f":"IF('5. Riskanalys'!L228=\"x\",\"x\",IF('5. Riskanalys'!M228<>\"\",\"x\",\"\"))","v":""}]
[{"$f":"'5. Riskanalys'!A229:A230","v":0},null,null,null,null,null,null,null,null,null,{"$f":"'5. Riskanalys'!H229","v":"Kvalitet"},{"$f":"'5. Riskanalys'!I229","v":{"$error":"#N/A"}},{"$f":"'5. Riskanalys'!J229","v":{"$error":"#N/A"}},{"$f":"'5. Riskanalys'!K229","v":{"$error":"#N/A"}},{"$f":"IF('5. Riskanalys'!L229=\"x\",\"x\",IF('5. Riskanalys'!M229<>\"\",\"x\",\"\"))","v":""}]
[null,null,null,null,null,null,null,null,null,null,{"$f":"'5. Riskanalys'!H230","v":"Leverans"},{"$f":"'5. Riskanalys'!I230","v":{"$error":"#N/A"}},{"$f":"'5. Riskanalys'!J230","v":{"$error":"#N/A"}},{"$f":"'5. Riskanalys'!K230","v":{"$error":"#N/A"}},{"$f":"IF('5. Riskanalys'!L230=\"x\",\"x\",IF('5. Riskanalys'!M230<>\"\",\"x\",\"\"))","v":""}]
[{"$f":"'5. Riskanalys'!A231:A232","v":0},null,null,null,null,null,null,null,null,null,{"$f":"'5. Riskanalys'!H231","v":"Kvalitet"},{"$f":"'5. Riskanalys'!I231","v":{"$error":"#N/A"}},{"$f":"'5. Riskanalys'!J231","v":{"$error":"#N/A"}},{"$f":"'5. Riskanalys'!K231","v":{"$error":"#N/A"}},{"$f":"IF('5. Riskanalys'!L231=\"x\",\"x\",IF('5. Riskanalys'!M231<>\"\",\"x\",\"\"))","v":""}]
[null,null,null,null,null,null,null,null,null,null,{"$f":"'5. Riskanalys'!H232","v":"Leverans"},{"$f":"'5. Riskanalys'!I232","v":{"$error":"#N/A"}},{"$f":"'5. Riskanalys'!J232","v":{"$error":"#N/A"}},{"$f":"'5. Riskanalys'!K232","v":{"$error":"#N/A"}},{"$f":"IF('5. Riskanalys'!L232=\"x\",\"x\",IF('5. Riskanalys'!M232<>\"\",\"x\",\"\"))","v":""}]
[{"$f":"'5. Riskanalys'!A233:A234","v":0},null,null,null,null,null,null,null,null,null,{"$f":"'5. Riskanalys'!H233","v":"Kvalitet"},{"$f":"'5. Riskanalys'!I233","v":{"$error":"#N/A"}},{"$f":"'5. Riskanalys'!J233","v":{"$error":"#N/A"}},{"$f":"'5. Riskanalys'!K233","v":{"$error":"#N/A"}},{"$f":"IF('5. Riskanalys'!L233=\"x\",\"x\",IF('5. Riskanalys'!M233<>\"\",\"x\",\"\"))","v":""}]
[null,null,null,null,null,null,null,null,null,null,{"$f":"'5. Riskanalys'!H234","v":"Leverans"},{"$f":"'5. Riskanalys'!I234","v":{"$error":"#N/A"}},{"$f":"'5. Riskanalys'!J234","v":{"$error":"#N/A"}},{"$f":"'5. Riskanalys'!K234","v":{"$error":"#N/A"}},{"$f":"IF('5. Riskanalys'!L234=\"x\",\"x\",IF('5. Riskanalys'!M234<>\"\",\"x\",\"\"))","v":""}]
[{"$f":"'5. Riskanalys'!A235:A236","v":0},null,null,null,null,null,null,null,null,null,{"$f":"'5. Riskanalys'!H235","v":"Kvalitet"},{"$f":"'5. Riskanalys'!I235","v":{"$error":"#N/A"}},{"$f":"'5. Riskanalys'!J235","v":{"$error":"#N/A"}},{"$f":"'5. Riskanalys'!K235","v":{"$error":"#N/A"}},{"$f":"IF('5. Riskanalys'!L235=\"x\",\"x\",IF('5. Riskanalys'!M235<>\"\",\"x\",\"\"))","v":""}]
[null,null,null,null,null,null,null,null,null,null,{"$f":"'5. Riskanalys'!H236","v":"Leverans"},{"$f":"'5. Riskanalys'!I236","v":{"$error":"#N/A"}},{"$f":"'5. Riskanalys'!J236","v":{"$error":"#N/A"}},{"$f":"'5. Riskanalys'!K236","v":{"$error":"#N/A"}},{"$f":"IF('5. Riskanalys'!L236=\"x\",\"x\",IF('5. Riskanalys'!M236<>\"\",\"x\",\"\"))","v":""}]
[{"$f":"'5. Riskanalys'!A237:A238","v":0},null,null,null,null,null,null,null,null,null,{"$f":"'5. Riskanalys'!H237","v":"Kvalitet"},{"$f":"'5. Riskanalys'!I237","v":{"$error":"#N/A"}},{"$f":"'5. Riskanalys'!J237","v":{"$error":"#N/A"}},{"$f":"'5. Riskanalys'!K237","v":{"$error":"#N/A"}},{"$f":"IF('5. Riskanalys'!L237=\"x\",\"x\",IF('5. Riskanalys'!M237<>\"\",\"x\",\"\"))","v":""}]
[null,null,null,null,null,null,null,null,null,null,{"$f":"'5. Riskanalys'!H238","v":"Leverans"},{"$f":"'5. Riskanalys'!I238","v":{"$error":"#N/A"}},{"$f":"'5. Riskanalys'!J238","v":{"$error":"#N/A"}},{"$f":"'5. Riskanalys'!K238","v":{"$error":"#N/A"}},{"$f":"IF('5. Riskanalys'!L238=\"x\",\"x\",IF('5. Riskanalys'!M238<>\"\",\"x\",\"\"))","v":""}]
[{"$f":"'5. Riskanalys'!A239:A240","v":0},null,null,null,null,null,null,null,null,null,{"$f":"'5. Riskanalys'!H239","v":"Kvalitet"},{"$f":"'5. Riskanalys'!I239","v":{"$error":"#N/A"}},{"$f":"'5. Riskanalys'!J239","v":{"$error":"#N/A"}},{"$f":"'5. Riskanalys'!K239","v":{"$error":"#N/A"}},{"$f":"IF('5. Riskanalys'!L239=\"x\",\"x\",IF('5. Riskanalys'!M239<>\"\",\"x\",\"\"))","v":""}]
[null,null,null,null,null,null,null,null,null,null,{"$f":"'5. Riskanalys'!H240","v":"Leverans"},{"$f":"'5. Riskanalys'!I240","v":{"$error":"#N/A"}},{"$f":"'5. Riskanalys'!J240","v":{"$error":"#N/A"}},{"$f":"'5. Riskanalys'!K240","v":{"$error":"#N/A"}},{"$f":"IF('5. Riskanalys'!L240=\"x\",\"x\",IF('5. Riskanalys'!M240<>\"\",\"x\",\"\"))","v":""}]
[{"$f":"'5. Riskanalys'!A241:A242","v":0},null,null,null,null,null,null,null,null,null,{"$f":"'5. Riskanalys'!H241","v":"Kvalitet"},{"$f":"'5. Riskanalys'!I241","v":{"$error":"#N/A"}},{"$f":"'5. Riskanalys'!J241","v":{"$error":"#N/A"}},{"$f":"'5. Riskanalys'!K241","v":{"$error":"#N/A"}},{"$f":"IF('5. Riskanalys'!L241=\"x\",\"x\",IF('5. Riskanalys'!M241<>\"\",\"x\",\"\"))","v":""}]
[null,null,null,null,null,null,null,null,null,null,{"$f":"'5. Riskanalys'!H242","v":"Leverans"},{"$f":"'5. Riskanalys'!I242","v":{"$error":"#N/A"}},{"$f":"'5. Riskanalys'!J242","v":{"$error":"#N/A"}},{"$f":"'5. Riskanalys'!K242","v":{"$error":"#N/A"}},{"$f":"IF('5. Riskanalys'!L242=\"x\",\"x\",IF('5. Riskanalys'!M242<>\"\",\"x\",\"\"))","v":""}]
[{"$f":"'5. Riskanalys'!A243:A244","v":0},null,null,null,null,null,null,null,null,null,{"$f":"'5. Riskanalys'!H243","v":"Kvalitet"},{"$f":"'5. Riskanalys'!I243","v":{"$error":"#N/A"}},{"$f":"'5. Riskanalys'!J243","v":{"$error":"#N/A"}},{"$f":"'5. Riskanalys'!K243","v":{"$error":"#N/A"}},{"$f":"IF('5. Riskanalys'!L243=\"x\",\"x\",IF('5. Riskanalys'!M243<>\"\",\"x\",\"\"))","v":""}]
[null,null,null,null,null,null,null,null,null,null,{"$f":"'5. Riskanalys'!H244","v":"Leverans"},{"$f":"'5. Riskanalys'!I244","v":{"$error":"#N/A"}},{"$f":"'5. Riskanalys'!J244","v":{"$error":"#N/A"}},{"$f":"'5. Riskanalys'!K244","v":{"$error":"#N/A"}},{"$f":"IF('5. Riskanalys'!L244=\"x\",\"x\",IF('5. Riskanalys'!M244<>\"\",\"x\",\"\"))","v":""}]
[{"$f":"'5. Riskanalys'!A245:A246","v":0},null,null,null,null,null,null,null,null,null,{"$f":"'5. Riskanalys'!H245","v":"Kvalitet"},{"$f":"'5. Riskanalys'!I245","v":{"$error":"#N/A"}},{"$f":"'5. Riskanalys'!J245","v":{"$error":"#N/A"}},{"$f":"'5. Riskanalys'!K245","v":{"$error":"#N/A"}},{"$f":"IF('5. Riskanalys'!L245=\"x\",\"x\",IF('5. Riskanalys'!M245<>\"\",\"x\",\"\"))","v":""}]
[null,null,null,null,null,null,null,null,null,null,{"$f":"'5. Riskanalys'!H246","v":"Leverans"},{"$f":"'5. Riskanalys'!I246","v":{"$error":"#N/A"}},{"$f":"'5. Riskanalys'!J246","v":{"$error":"#N/A"}},{"$f":"'5. Riskanalys'!K246","v":{"$error":"#N/A"}},{"$f":"IF('5. Riskanalys'!L246=\"x\",\"x\",IF('5. Riskanalys'!M246<>\"\",\"x\",\"\"))","v":""}]
[{"$f":"'5. Riskanalys'!A247:A248","v":0},null,null,null,null,null,null,null,null,null,{"$f":"'5. Riskanalys'!H247","v":"Kvalitet"},{"$f":"'5. Riskanalys'!I247","v":{"$error":"#N/A"}},{"$f":"'5. Riskanalys'!J247","v":{"$error":"#N/A"}},{"$f":"'5. Riskanalys'!K247","v":{"$error":"#N/A"}},{"$f":"IF('5. Riskanalys'!L247=\"x\",\"x\",IF('5. Riskanalys'!M247<>\"\",\"x\",\"\"))","v":""}]
[null,null,null,null,null,null,null,null,null,null,{"$f":"'5. Riskanalys'!H248","v":"Leverans"},{"$f":"'5. Riskanalys'!I248","v":{"$error":"#N/A"}},{"$f":"'5. Riskanalys'!J248","v":{"$error":"#N/A"}},{"$f":"'5. Riskanalys'!K248","v":{"$error":"#N/A"}},{"$f":"IF('5. Riskanalys'!L248=\"x\",\"x\",IF('5. Riskanalys'!M248<>\"\",\"x\",\"\"))","v":""}]
[{"$f":"'5. Riskanalys'!A249:A250","v":0},null,null,null,null,null,null,null,null,null,{"$f":"'5. Riskanalys'!H249","v":"Kvalitet"},{"$f":"'5. Riskanalys'!I249","v":{"$error":"#N/A"}},{"$f":"'5. Riskanalys'!J249","v":{"$error":"#N/A"}},{"$f":"'5. Riskanalys'!K249","v":{"$error":"#N/A"}},{"$f":"IF('5. Riskanalys'!L249=\"x\",\"x\",IF('5. Riskanalys'!M249<>\"\",\"x\",\"\"))","v":""}]
[null,null,null,null,null,null,null,null,null,null,{"$f":"'5. Riskanalys'!H250","v":"Leverans"},{"$f":"'5. Riskanalys'!I250","v":{"$error":"#N/A"}},{"$f":"'5. Riskanalys'!J250","v":{"$error":"#N/A"}},{"$f":"'5. Riskanalys'!K250","v":{"$error":"#N/A"}},{"$f":"IF('5. Riskanalys'!L250=\"x\",\"x\",IF('5. Riskanalys'!M250<>\"\",\"x\",\"\"))","v":""}]
[{"$f":"'5. Riskanalys'!A251:A252","v":0},null,null,null,null,null,null,null,null,null,{"$f":"'5. Riskanalys'!H251","v":"Kvalitet"},{"$f":"'5. Riskanalys'!I251","v":{"$error":"#N/A"}},{"$f":"'5. Riskanalys'!J251","v":{"$error":"#N/A"}},{"$f":"'5. Riskanalys'!K251","v":{"$error":"#N/A"}},{"$f":"IF('5. Riskanalys'!L251=\"x\",\"x\",IF('5. Riskanalys'!M251<>\"\",\"x\",\"\"))","v":""}]
[null,null,null,null,null,null,null,null,null,null,{"$f":"'5. Riskanalys'!H252","v":"Leverans"},{"$f":"'5. Riskanalys'!I252","v":{"$error":"#N/A"}},{"$f":"'5. Riskanalys'!J252","v":{"$error":"#N/A"}},{"$f":"'5. Riskanalys'!K252","v":{"$error":"#N/A"}},{"$f":"IF('5. Riskanalys'!L252=\"x\",\"x\",IF('5. Riskanalys'!M252<>\"\",\"x\",\"\"))","v":""}]
[{"$f":"'5. Riskanalys'!A253:A254","v":0},null,null,null,null,null,null,null,null,null,{"$f":"'5. Riskanalys'!H253","v":"Kvalitet"},{"$f":"'5. Riskanalys'!I253","v":{"$error":"#N/A"}},{"$f":"'5. Riskanalys'!J253","v":{"$error":"#N/A"}},{"$f":"'5. Riskanalys'!K253","v":{"$error":"#N/A"}},{"$f":"IF('5. Riskanalys'!L253=\"x\",\"x\",IF('5. Riskanalys'!M253<>\"\",\"x\",\"\"))","v":""}]
[null,null,null,null,null,null,null,null,null,null,{"$f":"'5. Riskanalys'!H254","v":"Leverans"},{"$f":"'5. Riskanalys'!I254","v":{"$error":"#N/A"}},{"$f":"'5. Riskanalys'!J254","v":{"$error":"#N/A"}},{"$f":"'5. Riskanalys'!K254","v":{"$error":"#N/A"}},{"$f":"IF('5. Riskanalys'!L254=\"x\",\"x\",IF('5. Riskanalys'!M254<>\"\",\"x\",\"\"))","v":""}]
[{"$f":"'5. Riskanalys'!A255:A256","v":0},null,null,null,null,null,null,null,null,null,{"$f":"'5. Riskanalys'!H255","v":"Kvalitet"},{"$f":"'5. Riskanalys'!I255","v":{"$error":"#N/A"}},{"$f":"'5. Riskanalys'!J255","v":{"$error":"#N/A"}},{"$f":"'5. Riskanalys'!K255","v":{"$error":"#N/A"}},{"$f":"IF('5. Riskanalys'!L255=\"x\",\"x\",IF('5. Riskanalys'!M255<>\"\",\"x\",\"\"))","v":""}]
[null,null,null,null,null,null,null,null,null,null,{"$f":"'5. Riskanalys'!H256","v":"Leverans"},{"$f":"'5. Riskanalys'!I256","v":{"$error":"#N/A"}},{"$f":"'5. Riskanalys'!J256","v":{"$error":"#N/A"}},{"$f":"'5. Riskanalys'!K256","v":{"$error":"#N/A"}},{"$f":"IF('5. Riskanalys'!L256=\"x\",\"x\",IF('5. Riskanalys'!M256<>\"\",\"x\",\"\"))","v":""}]
[{"$f":"'5. Riskanalys'!A257:A258","v":0},null,null,null,null,null,null,null,null,null,{"$f":"'5. Riskanalys'!H257","v":"Kvalitet"},{"$f":"'5. Riskanalys'!I257","v":{"$error":"#N/A"}},{"$f":"'5. Riskanalys'!J257","v":{"$error":"#N/A"}},{"$f":"'5. Riskanalys'!K257","v":{"$error":"#N/A"}},{"$f":"IF('5. Riskanalys'!L257=\"x\",\"x\",IF('5. Riskanalys'!M257<>\"\",\"x\",\"\"))","v":""}]
[null,null,null,null,null,null,null,null,null,null,{"$f":"'5. Riskanalys'!H258","v":"Leverans"},{"$f":"'5. Riskanalys'!I258","v":{"$error":"#N/A"}},{"$f":"'5. Riskanalys'!J258","v":{"$error":"#N/A"}},{"$f":"'5. Riskanalys'!K258","v":{"$error":"#N/A"}},{"$f":"IF('5. Riskanalys'!L258=\"x\",\"x\",IF('5. Riskanalys'!M258<>\"\",\"x\",\"\"))","v":""}]
[{"$f":"'5. Riskanalys'!A259:A260","v":0},null,null,null,null,null,null,null,null,null,{"$f":"'5. Riskanalys'!H259","v":"Kvalitet"},{"$f":"'5. Riskanalys'!I259","v":{"$error":"#N/A"}},{"$f":"'5. Riskanalys'!J259","v":{"$error":"#N/A"}},{"$f":"'5. Riskanalys'!K259","v":{"$error":"#N/A"}},{"$f":"IF('5. Riskanalys'!L259=\"x\",\"x\",IF('5. Riskanalys'!M259<>\"\",\"x\",\"\"))","v":""}]
[null,null,null,null,null,null,null,null,null,null,{"$f":"'5. Riskanalys'!H260","v":"Leverans"},{"$f":"'5. Riskanalys'!I260","v":{"$error":"#N/A"}},{"$f":"'5. Riskanalys'!J260","v":{"$error":"#N/A"}},{"$f":"'5. Riskanalys'!K260","v":{"$error":"#N/A"}},{"$f":"IF('5. Riskanalys'!L260=\"x\",\"x\",IF('5. Riskanalys'!M260<>\"\",\"x\",\"\"))","v":""}]
[{"$f":"'5. Riskanalys'!A261:A262","v":0},null,null,null,null,null,null,null,null,null,{"$f":"'5. Riskanalys'!H261","v":"Kvalitet"},{"$f":"'5. Riskanalys'!I261","v":{"$error":"#N/A"}},{"$f":"'5. Riskanalys'!J261","v":{"$error":"#N/A"}},{"$f":"'5. Riskanalys'!K261","v":{"$error":"#N/A"}},{"$f":"IF('5. Riskanalys'!L261=\"x\",\"x\",IF('5. Riskanalys'!M261<>\"\",\"x\",\"\"))","v":""}]
[null,null,null,null,null,null,null,null,null,null,{"$f":"'5. Riskanalys'!H262","v":"Leverans"},{"$f":"'5. Riskanalys'!I262","v":{"$error":"#N/A"}},{"$f":"'5. Riskanalys'!J262","v":{"$error":"#N/A"}},{"$f":"'5. Riskanalys'!K262","v":{"$error":"#N/A"}},{"$f":"IF('5. Riskanalys'!L262=\"x\",\"x\",IF('5. Riskanalys'!M262<>\"\",\"x\",\"\"))","v":""}]
[{"$f":"'5. Riskanalys'!A263:A264","v":0},null,null,null,null,null,null,null,null,null,{"$f":"'5. Riskanalys'!H263","v":"Kvalitet"},{"$f":"'5. Riskanalys'!I263","v":{"$error":"#N/A"}},{"$f":"'5. Riskanalys'!J263","v":{"$error":"#N/A"}},{"$f":"'5. Riskanalys'!K263","v":{"$error":"#N/A"}},{"$f":"IF('5. Riskanalys'!L263=\"x\",\"x\",IF('5. Riskanalys'!M263<>\"\",\"x\",\"\"))","v":""}]
[null,null,null,null,null,null,null,null,null,null,{"$f":"'5. Riskanalys'!H264","v":"Leverans"},{"$f":"'5. Riskanalys'!I264","v":{"$error":"#N/A"}},{"$f":"'5. Riskanalys'!J264","v":{"$error":"#N/A"}},{"$f":"'5. Riskanalys'!K264","v":{"$error":"#N/A"}},{"$f":"IF('5. Riskanalys'!L264=\"x\",\"x\",IF('5. Riskanalys'!M264<>\"\",\"x\",\"\"))","v":""}]
[{"$f":"'5. Riskanalys'!A265:A266","v":0},null,null,null,null,null,null,null,null,null,{"$f":"'5. Riskanalys'!H265","v":"Kvalitet"},{"$f":"'5. Riskanalys'!I265","v":{"$error":"#N/A"}},{"$f":"'5. Riskanalys'!J265","v":{"$error":"#N/A"}},{"$f":"'5. Riskanalys'!K265","v":{"$error":"#N/A"}},{"$f":"IF('5. Riskanalys'!L265=\"x\",\"x\",IF('5. Riskanalys'!M265<>\"\",\"x\",\"\"))","v":""}]
[null,null,null,null,null,null,null,null,null,null,{"$f":"'5. Riskanalys'!H266","v":"Leverans"},{"$f":"'5. Riskanalys'!I266","v":{"$error":"#N/A"}},{"$f":"'5. Riskanalys'!J266","v":{"$error":"#N/A"}},{"$f":"'5. Riskanalys'!K266","v":{"$error":"#N/A"}},{"$f":"IF('5. Riskanalys'!L266=\"x\",\"x\",IF('5. Riskanalys'!M266<>\"\",\"x\",\"\"))","v":""}]
[{"$f":"'5. Riskanalys'!A267:A268","v":0},null,null,null,null,null,null,null,null,null,{"$f":"'5. Riskanalys'!H267","v":"Kvalitet"},{"$f":"'5. Riskanalys'!I267","v":{"$error":"#N/A"}},{"$f":"'5. Riskanalys'!J267","v":{"$error":"#N/A"}},{"$f":"'5. Riskanalys'!K267","v":{"$error":"#N/A"}},{"$f":"IF('5. Riskanalys'!L267=\"x\",\"x\",IF('5. Riskanalys'!M267<>\"\",\"x\",\"\"))","v":""}]
[null,null,null,null,null,null,null,null,null,null,{"$f":"'5. Riskanalys'!H268","v":"Leverans"},{"$f":"'5. Riskanalys'!I268","v":{"$error":"#N/A"}},{"$f":"'5. Riskanalys'!J268","v":{"$error":"#N/A"}},{"$f":"'5. Riskanalys'!K268","v":{"$error":"#N/A"}},{"$f":"IF('5. Riskanalys'!L268=\"x\",\"x\",IF('5. Riskanalys'!M268<>\"\",\"x\",\"\"))","v":""}]
[{"$f":"'5. Riskanalys'!A269:A270","v":0},null,null,null,null,null,null,null,null,null,{"$f":"'5. Riskanalys'!H269","v":"Kvalitet"},{"$f":"'5. Riskanalys'!I269","v":{"$error":"#N/A"}},{"$f":"'5. Riskanalys'!J269","v":{"$error":"#N/A"}},{"$f":"'5. Riskanalys'!K269","v":{"$error":"#N/A"}},{"$f":"IF('5. Riskanalys'!L269=\"x\",\"x\",IF('5. Riskanalys'!M269<>\"\",\"x\",\"\"))","v":""}]
[null,null,null,null,null,null,null,null,null,null,{"$f":"'5. Riskanalys'!H270","v":"Leverans"},{"$f":"'5. Riskanalys'!I270","v":{"$error":"#N/A"}},{"$f":"'5. Riskanalys'!J270","v":{"$error":"#N/A"}},{"$f":"'5. Riskanalys'!K270","v":{"$error":"#N/A"}},{"$f":"IF('5. Riskanalys'!L270=\"x\",\"x\",IF('5. Riskanalys'!M270<>\"\",\"x\",\"\"))","v":""}]
[{"$f":"'5. Riskanalys'!A271:A272","v":0},null,null,null,null,null,null,null,null,null,{"$f":"'5. Riskanalys'!H271","v":"Kvalitet"},{"$f":"'5. Riskanalys'!I271","v":{"$error":"#N/A"}},{"$f":"'5. Riskanalys'!J271","v":{"$error":"#N/A"}},{"$f":"'5. Riskanalys'!K271","v":{"$error":"#N/A"}},{"$f":"IF('5. Riskanalys'!L271=\"x\",\"x\",IF('5. Riskanalys'!M271<>\"\",\"x\",\"\"))","v":""}]
[null,null,null,null,null,null,null,null,null,null,{"$f":"'5. Riskanalys'!H272","v":"Leverans"},{"$f":"'5. Riskanalys'!I272","v":{"$error":"#N/A"}},{"$f":"'5. Riskanalys'!J272","v":{"$error":"#N/A"}},{"$f":"'5. Riskanalys'!K272","v":{"$error":"#N/A"}},{"$f":"IF('5. Riskanalys'!L272=\"x\",\"x\",IF('5. Riskanalys'!M272<>\"\",\"x\",\"\"))","v":""}]
[{"$f":"'5. Riskanalys'!A273:A274","v":0},null,null,null,null,null,null,null,null,null,{"$f":"'5. Riskanalys'!H273","v":"Kvalitet"},{"$f":"'5. Riskanalys'!I273","v":{"$error":"#N/A"}},{"$f":"'5. Riskanalys'!J273","v":{"$error":"#N/A"}},{"$f":"'5. Riskanalys'!K273","v":{"$error":"#N/A"}},{"$f":"IF('5. Riskanalys'!L273=\"x\",\"x\",IF('5. Riskanalys'!M273<>\"\",\"x\",\"\"))","v":""}]
[null,null,null,null,null,null,null,null,null,null,{"$f":"'5. Riskanalys'!H274","v":"Leverans"},{"$f":"'5. Riskanalys'!I274","v":{"$error":"#N/A"}},{"$f":"'5. Riskanalys'!J274","v":{"$error":"#N/A"}},{"$f":"'5. Riskanalys'!K274","v":{"$error":"#N/A"}},{"$f":"IF('5. Riskanalys'!L274=\"x\",\"x\",IF('5. Riskanalys'!M274<>\"\",\"x\",\"\"))","v":""}]
[{"$f":"'5. Riskanalys'!A275:A276","v":0},null,null,null,null,null,null,null,null,null,{"$f":"'5. Riskanalys'!H275","v":"Kvalitet"},{"$f":"'5. Riskanalys'!I275","v":{"$error":"#N/A"}},{"$f":"'5. Riskanalys'!J275","v":{"$error":"#N/A"}},{"$f":"'5. Riskanalys'!K275","v":{"$error":"#N/A"}},{"$f":"IF('5. Riskanalys'!L275=\"x\",\"x\",IF('5. Riskanalys'!M275<>\"\",\"x\",\"\"))","v":""}]
[null,null,null,null,null,null,null,null,null,null,{"$f":"'5. Riskanalys'!H276","v":"Leverans"},{"$f":"'5. Riskanalys'!I276","v":{"$error":"#N/A"}},{"$f":"'5. Riskanalys'!J276","v":{"$error":"#N/A"}},{"$f":"'5. Riskanalys'!K276","v":{"$error":"#N/A"}},{"$f":"IF('5. Riskanalys'!L276=\"x\",\"x\",IF('5. Riskanalys'!M276<>\"\",\"x\",\"\"))","v":""}]
[{"$f":"'5. Riskanalys'!A277:A278","v":0},null,null,null,null,null,null,null,null,null,{"$f":"'5. Riskanalys'!H277","v":"Kvalitet"},{"$f":"'5. Riskanalys'!I277","v":{"$error":"#N/A"}},{"$f":"'5. Riskanalys'!J277","v":{"$error":"#N/A"}},{"$f":"'5. Riskanalys'!K277","v":{"$error":"#N/A"}},{"$f":"IF('5. Riskanalys'!L277=\"x\",\"x\",IF('5. Riskanalys'!M277<>\"\",\"x\",\"\"))","v":""}]
[null,null,null,null,null,null,null,null,null,null,{"$f":"'5. Riskanalys'!H278","v":"Leverans"},{"$f":"'5. Riskanalys'!I278","v":{"$error":"#N/A"}},{"$f":"'5. Riskanalys'!J278","v":{"$error":"#N/A"}},{"$f":"'5. Riskanalys'!K278","v":{"$error":"#N/A"}},{"$f":"IF('5. Riskanalys'!L278=\"x\",\"x\",IF('5. Riskanalys'!M278<>\"\",\"x\",\"\"))","v":""}]
[{"$f":"'5. Riskanalys'!A279:A280","v":0},null,null,null,null,null,null,null,null,null,{"$f":"'5. Riskanalys'!H279","v":"Kvalitet"},{"$f":"'5. Riskanalys'!I279","v":{"$error":"#N/A"}},{"$f":"'5. Riskanalys'!J279","v":{"$error":"#N/A"}},{"$f":"'5. Riskanalys'!K279","v":{"$error":"#N/A"}},{"$f":"IF('5. Riskanalys'!L279=\"x\",\"x\",IF('5. Riskanalys'!M279<>\"\",\"x\",\"\"))","v":""}]
[null,null,null,null,null,null,null,null,null,null,{"$f":"'5. Riskanalys'!H280","v":"Leverans"},{"$f":"'5. Riskanalys'!I280","v":{"$error":"#N/A"}},{"$f":"'5. Riskanalys'!J280","v":{"$error":"#N/A"}},{"$f":"'5. Riskanalys'!K280","v":{"$error":"#N/A"}},{"$f":"IF('5. Riskanalys'!L280=\"x\",\"x\",IF('5. Riskanalys'!M280<>\"\",\"x\",\"\"))","v":""}]
[{"$f":"'5. Riskanalys'!A281:A282","v":0},null,null,null,null,null,null,null,null,null,{"$f":"'5. Riskanalys'!H281","v":"Kvalitet"},{"$f":"'5. Riskanalys'!I281","v":{"$error":"#N/A"}},{"$f":"'5. Riskanalys'!J281","v":{"$error":"#N/A"}},{"$f":"'5. Riskanalys'!K281","v":{"$error":"#N/A"}},{"$f":"IF('5. Riskanalys'!L281=\"x\",\"x\",IF('5. Riskanalys'!M281<>\"\",\"x\",\"\"))","v":""}]
[null,null,null,null,null,null,null,null,null,null,{"$f":"'5. Riskanalys'!H282","v":"Leverans"},{"$f":"'5. Riskanalys'!I282","v":{"$error":"#N/A"}},{"$f":"'5. Riskanalys'!J282","v":{"$error":"#N/A"}},{"$f":"'5. Riskanalys'!K282","v":{"$error":"#N/A"}},{"$f":"IF('5. Riskanalys'!L282=\"x\",\"x\",IF('5. Riskanalys'!M282<>\"\",\"x\",\"\"))","v":""}]
[{"$f":"'5. Riskanalys'!A283:A284","v":0},null,null,null,null,null,null,null,null,null,{"$f":"'5. Riskanalys'!H283","v":"Kvalitet"},{"$f":"'5. Riskanalys'!I283","v":{"$error":"#N/A"}},{"$f":"'5. Riskanalys'!J283","v":{"$error":"#N/A"}},{"$f":"'5. Riskanalys'!K283","v":{"$error":"#N/A"}},{"$f":"IF('5. Riskanalys'!L283=\"x\",\"x\",IF('5. Riskanalys'!M283<>\"\",\"x\",\"\"))","v":""}]
[null,null,null,null,null,null,null,null,null,null,{"$f":"'5. Riskanalys'!H284","v":"Leverans"},{"$f":"'5. Riskanalys'!I284","v":{"$error":"#N/A"}},{"$f":"'5. Riskanalys'!J284","v":{"$error":"#N/A"}},{"$f":"'5. Riskanalys'!K284","v":{"$error":"#N/A"}},{"$f":"IF('5. Riskanalys'!L284=\"x\",\"x\",IF('5. Riskanalys'!M284<>\"\",\"x\",\"\"))","v":""}]
[{"$f":"'5. Riskanalys'!A285:A286","v":0},null,null,null,null,null,null,null,null,null,{"$f":"'5. Riskanalys'!H285","v":"Kvalitet"},{"$f":"'5. Riskanalys'!I285","v":{"$error":"#N/A"}},{"$f":"'5. Riskanalys'!J285","v":{"$error":"#N/A"}},{"$f":"'5. Riskanalys'!K285","v":{"$error":"#N/A"}},{"$f":"IF('5. Riskanalys'!L285=\"x\",\"x\",IF('5. Riskanalys'!M285<>\"\",\"x\",\"\"))","v":""}]
[null,null,null,null,null,null,null,null,null,null,{"$f":"'5. Riskanalys'!H286","v":"Leverans"},{"$f":"'5. Riskanalys'!I286","v":{"$error":"#N/A"}},{"$f":"'5. Riskanalys'!J286","v":{"$error":"#N/A"}},{"$f":"'5. Riskanalys'!K286","v":{"$error":"#N/A"}},{"$f":"IF('5. Riskanalys'!L286=\"x\",\"x\",IF('5. Riskanalys'!M286<>\"\",\"x\",\"\"))","v":""}]
[{"$f":"'5. Riskanalys'!A287:A288","v":0},null,null,null,null,null,null,null,null,null,{"$f":"'5. Riskanalys'!H287","v":"Kvalitet"},{"$f":"'5. Riskanalys'!I287","v":{"$error":"#N/A"}},{"$f":"'5. Riskanalys'!J287","v":{"$error":"#N/A"}},{"$f":"'5. Riskanalys'!K287","v":{"$error":"#N/A"}},{"$f":"IF('5. Riskanalys'!L287=\"x\",\"x\",IF('5. Riskanalys'!M287<>\"\",\"x\",\"\"))","v":""}]
[null,null,null,null,null,null,null,null,null,null,{"$f":"'5. Riskanalys'!H288","v":"Leverans"},{"$f":"'5. Riskanalys'!I288","v":{"$error":"#N/A"}},{"$f":"'5. Riskanalys'!J288","v":{"$error":"#N/A"}},{"$f":"'5. Riskanalys'!K288","v":{"$error":"#N/A"}},{"$f":"IF('5. Riskanalys'!L288=\"x\",\"x\",IF('5. Riskanalys'!M288<>\"\",\"x\",\"\"))","v":""}]
[{"$f":"'5. Riskanalys'!A289:A290","v":0},null,null,null,null,null,null,null,null,null,{"$f":"'5. Riskanalys'!H289","v":"Kvalitet"},{"$f":"'5. Riskanalys'!I289","v":{"$error":"#N/A"}},{"$f":"'5. Riskanalys'!J289","v":{"$error":"#N/A"}},{"$f":"'5. Riskanalys'!K289","v":{"$error":"#N/A"}},{"$f":"IF('5. Riskanalys'!L289=\"x\",\"x\",IF('5. Riskanalys'!M289<>\"\",\"x\",\"\"))","v":""}]
[null,null,null,null,null,null,null,null,null,null,{"$f":"'5. Riskanalys'!H290","v":"Leverans"},{"$f":"'5. Riskanalys'!I290","v":{"$error":"#N/A"}},{"$f":"'5. Riskanalys'!J290","v":{"$error":"#N/A"}},{"$f":"'5. Riskanalys'!K290","v":{"$error":"#N/A"}},{"$f":"IF('5. Riskanalys'!L290=\"x\",\"x\",IF('5. Riskanalys'!M290<>\"\",\"x\",\"\"))","v":""}]
[{"$f":"'5. Riskanalys'!A291:A292","v":0},null,null,null,null,null,null,null,null,null,{"$f":"'5. Riskanalys'!H291","v":"Kvalitet"},{"$f":"'5. Riskanalys'!I291","v":{"$error":"#N/A"}},{"$f":"'5. Riskanalys'!J291","v":{"$error":"#N/A"}},{"$f":"'5. Riskanalys'!K291","v":{"$error":"#N/A"}},{"$f":"IF('5. Riskanalys'!L291=\"x\",\"x\",IF('5. Riskanalys'!M291<>\"\",\"x\",\"\"))","v":""}]
[null,null,null,null,null,null,null,null,null,null,{"$f":"'5. Riskanalys'!H292","v":"Leverans"},{"$f":"'5. Riskanalys'!I292","v":{"$error":"#N/A"}},{"$f":"'5. Riskanalys'!J292","v":{"$error":"#N/A"}},{"$f":"'5. Riskanalys'!K292","v":{"$error":"#N/A"}},{"$f":"IF('5. Riskanalys'!L292=\"x\",\"x\",IF('5. Riskanalys'!M292<>\"\",\"x\",\"\"))","v":""}]
[{"$f":"'5. Riskanalys'!A293:A294","v":0},null,null,null,null,null,null,null,null,null,{"$f":"'5. Riskanalys'!H293","v":"Kvalitet"},{"$f":"'5. Riskanalys'!I293","v":{"$error":"#N/A"}},{"$f":"'5. Riskanalys'!J293","v":{"$error":"#N/A"}},{"$f":"'5. Riskanalys'!K293","v":{"$error":"#N/A"}},{"$f":"IF('5. Riskanalys'!L293=\"x\",\"x\",IF('5. Riskanalys'!M293<>\"\",\"x\",\"\"))","v":""}]
[null,null,null,null,null,null,null,null,null,null,{"$f":"'5. Riskanalys'!H294","v":"Leverans"},{"$f":"'5. Riskanalys'!I294","v":{"$error":"#N/A"}},{"$f":"'5. Riskanalys'!J294","v":{"$error":"#N/A"}},{"$f":"'5. Riskanalys'!K294","v":{"$error":"#N/A"}},{"$f":"IF('5. Riskanalys'!L294=\"x\",\"x\",IF('5. Riskanalys'!M294<>\"\",\"x\",\"\"))","v":""}]
[{"$f":"'5. Riskanalys'!A295:A296","v":0},null,null,null,null,null,null,null,null,null,{"$f":"'5. Riskanalys'!H295","v":"Kvalitet"},{"$f":"'5. Riskanalys'!I295","v":{"$error":"#N/A"}},{"$f":"'5. Riskanalys'!J295","v":{"$error":"#N/A"}},{"$f":"'5. Riskanalys'!K295","v":{"$error":"#N/A"}},{"$f":"IF('5. Riskanalys'!L295=\"x\",\"x\",IF('5. Riskanalys'!M295<>\"\",\"x\",\"\"))","v":""}]
[null,null,null,null,null,null,null,null,null,null,{"$f":"'5. Riskanalys'!H296","v":"Leverans"},{"$f":"'5. Riskanalys'!I296","v":{"$error":"#N/A"}},{"$f":"'5. Riskanalys'!J296","v":{"$error":"#N/A"}},{"$f":"'5. Riskanalys'!K296","v":{"$error":"#N/A"}},{"$f":"IF('5. Riskanalys'!L296=\"x\",\"x\",IF('5. Riskanalys'!M296<>\"\",\"x\",\"\"))","v":""}]
[{"$f":"'5. Riskanalys'!#REF!","v":{"$error":"#REF!"}},null,null,null,null,null,null,null,null,null,{"$f":"'5. Riskanalys'!#REF!","v":{"$error":"#REF!"}},{"$f":"'5. Riskanalys'!#REF!","v":{"$error":"#REF!"}},{"$f":"'5. Riskanalys'!#REF!","v":{"$error":"#REF!"}},{"$f":"'5. Riskanalys'!#REF!","v":{"$error":"#REF!"}},{"$f":"IF('5. Riskanalys'!#REF!=\"x\",\"x\",IF('5. Riskanalys'!#REF!<>\"\",\"x\",\"\"))","v":{"$error":"#REF!"}}]
[null,null,null,null,null,null,null,null,null,null,{"$f":"'5. Riskanalys'!#REF!","v":{"$error":"#REF!"}},{"$f":"'5. Riskanalys'!#REF!","v":{"$error":"#REF!"}},{"$f":"'5. Riskanalys'!#REF!","v":{"$error":"#REF!"}},{"$f":"'5. Riskanalys'!#REF!","v":{"$error":"#REF!"}},{"$f":"IF('5. Riskanalys'!#REF!=\"x\",\"x\",IF('5. Riskanalys'!#REF!<>\"\",\"x\",\"\"))","v":{"$error":"#REF!"}}]
[{"$f":"'5. Riskanalys'!#REF!","v":{"$error":"#REF!"}},null,null,null,null,null,null,null,null,null,{"$f":"'5. Riskanalys'!#REF!","v":{"$error":"#REF!"}},{"$f":"'5. Riskanalys'!#REF!","v":{"$error":"#REF!"}},{"$f":"'5. Riskanalys'!#REF!","v":{"$error":"#REF!"}},{"$f":"'5. Riskanalys'!#REF!","v":{"$error":"#REF!"}},{"$f":"IF('5. Riskanalys'!#REF!=\"x\",\"x\",IF('5. Riskanalys'!#REF!<>\"\",\"x\",\"\"))","v":{"$error":"#REF!"}}]
[null,null,null,null,null,null,null,null,null,null,{"$f":"'5. Riskanalys'!#REF!","v":{"$error":"#REF!"}},{"$f":"'5. Riskanalys'!#REF!","v":{"$error":"#REF!"}},{"$f":"'5. Riskanalys'!#REF!","v":{"$error":"#REF!"}},{"$f":"'5. Riskanalys'!#REF!","v":{"$error":"#REF!"}},{"$f":"IF('5. Riskanalys'!#REF!=\"x\",\"x\",IF('5. Riskanalys'!#REF!<>\"\",\"x\",\"\"))","v":{"$error":"#REF!"}}]
[{"$f":"'5. Riskanalys'!#REF!","v":{"$error":"#REF!"}},null,null,null,null,null,null,null,null,null,{"$f":"'5. Riskanalys'!#REF!","v":{"$error":"#REF!"}},{"$f":"'5. Riskanalys'!#REF!","v":{"$error":"#REF!"}},{"$f":"'5. Riskanalys'!#REF!","v":{"$error":"#REF!"}},{"$f":"'5. Riskanalys'!#REF!","v":{"$error":"#REF!"}},{"$f":"IF('5. Riskanalys'!#REF!=\"x\",\"x\",IF('5. Riskanalys'!#REF!<>\"\",\"x\",\"\"))","v":{"$error":"#REF!"}}]
[null,null,null,null,null,null,null,null,null,null,{"$f":"'5. Riskanalys'!#REF!","v":{"$error":"#REF!"}},{"$f":"'5. Riskanalys'!#REF!","v":{"$error":"#REF!"}},{"$f":"'5. Riskanalys'!#REF!","v":{"$error":"#REF!"}},{"$f":"'5. Riskanalys'!#REF!","v":{"$error":"#REF!"}},{"$f":"IF('5. Riskanalys'!#REF!=\"x\",\"x\",IF('5. Riskanalys'!#REF!<>\"\",\"x\",\"\"))","v":{"$error":"#REF!"}}]

{"sheet":"Beräkningsunderlag riskmatris","index":7,"n_rows":17,"n_cols":6,"rows_kept":17,"cut":false,"hidden":false,"merged":[[2,0,2,1],[3,2,3,5]]}
["Beräkningstabell för färgmarkering av risker"]
[]
["Beräkningsvärde",null,1,5,10,16]
[null,null,"Konsekvens"]
[null,"Sannolikhet","Liten \n(K1)","Medelstor (K2)","Stor\n(K3)","Mycket stor (K4)"]
[1,"Liten (S1)",{"$f":"A6*$C$3","v":1},{"$f":"A6*$D$3","v":5},{"$f":"A6*$E$3","v":10},{"$f":"A6*$F$3","v":16}]
[2,"Medelstor (S2)",{"$f":"A7*$C$3","v":2},{"$f":"A7*$D$3","v":10},{"$f":"A7*$E$3","v":20},{"$f":"A7*$F$3","v":32}]
[3,"Stor (S3)",{"$f":"A8*$C$3","v":3},{"$f":"A8*$D$3","v":15},{"$f":"A8*$E$3","v":30},{"$f":"A8*$F$3","v":48}]
[4,"Mycket stor (S4)",{"$f":"A9*$C$3","v":4},{"$f":"A9*$D$3","v":20},{"$f":"A9*$E$3","v":40},{"$f":"A9*$F$3","v":64}]
[]
[]
["(Tabell som används i riskformel)"]
[null,"Konsekvens","Beräknas"]
[null,1,{"$f":"C3","v":1}]
[null,2,{"$f":"D3","v":5}]
[null,3,{"$f":"E3","v":10}]
[null,4,{"$f":"F3","v":16}]